program: Orca
programVersion: 5.0.2
elementType: Cl Cl F O O O N C C C C C C C C C C C C C C C C C C C C C C H H H H H H H H H H H H H H H H H H
charge: 0
multiplicity: 1
keywords: wb97x-d3
keywords: def2-TZVPP
keywords: def2/J RIJCOSX
keywords: DEFGRID2
keywords: scfconv7
keywords: smallprint printgap noloewdin
keywords: NOSOSCF
formula: C22H18Cl2FNO3
InChI: InChI=1/C22H18Cl2FNO3/c1-22(2)15(11-19(23)24)20(22)21(27)29-18(12-26)13-8-9-16(25)17(10-13)28-14-6-4-3-5-7-14/h3-11,15,18,20H,1-2H3
47 atoms
Cl -4.248488 4.232798 0.407685
Cl -5.437168 3.620367 -2.147758
F  5.132416 -3.44589 0.822081
O  1.075633 1.012427 -0.990066
O  0.334246 1.9915 0.886452
O  2.528047 -3.606139 0.281452
N  3.564209 2.344981 -2.718816
C  -2.211223 0.254835 0.185589
C  -2.457458 1.699567 -0.135244
C  -1.21136 1.017368 -0.665463
C  -2.984645 -0.827785 -0.526718
C  -1.89069 -0.096251 1.617104
C  -3.479338 2.1284 -1.097547
C  0.105655 1.41118 -0.140446
C  -4.272859 3.182604 -0.956185
C  2.423133 1.24585 -0.639398
C  3.13832 -0.03591 -0.255364
C  3.051166 1.857778 -1.814424
C  2.454554 -1.237555 -0.161397
C  4.501284 0.014182 0.016147
C  3.132961 -2.390983 0.210603
C  5.184037 -1.136343 0.372183
C  4.492271 -2.326106 0.471787
C  1.322209 -3.701813 0.93103
C  1.116493 -3.112303 2.171703
C  0.327593 -4.45197 0.323261
C  -0.105666 -3.284108 2.804945
C  -0.888016 -4.620344 0.972247
C  -1.111959 -4.034025 2.210004
H  -2.281029 2.375383 0.693785
H  -1.214652 0.751101 -1.716308
H  -2.458565 -1.780387 -0.439637
H  -3.971033 -0.953368 -0.076253
H  -3.123703 -0.629603 -1.588839
H  -1.200305 -0.940305 1.665676
H  -1.458863 0.728943 2.179244
H  -2.807197 -0.393652 2.13012
H  -3.595896 1.549079 -2.005679
H  2.499666 1.967537 0.181258
H  1.395907 -1.302311 -0.377864
H  5.043121 0.949697 -0.05082
H  6.245037 -1.107527 0.58334
H  1.89809 -2.532148 2.647052
H  0.506298 -4.904521 -0.644075
H  -0.269263 -2.826642 3.772261
H  -1.664563 -5.208269 0.500312
H  -2.062883 -4.161973 2.710073
elementType: Cl F O N C H
totalener: -2149.93736181 hartree
nucrepener: 2948.73243813 hartree
electener: -5098.66979995 hartree
oneelecener: -8809.80827126 hartree
twoeener: 3711.13847132 hartree
cpcmener: -0.03191751 hartree
kineticenergy: 2143.45509877 hartree
xcener: -159.160489817949 hartree
chargesum: -0.0000000
charge: -0.054544 -0.059200 -0.208916 -0.291986 -0.431777 -0.329645 -0.088324 0.123033 0.020948 -0.092843 -0.270923 -0.256734 -0.202743 0.390266 0.041535 0.407406 0.023400 -0.218970 -0.129502 -0.219143 0.144903 -0.160502 0.208421 0.217406 -0.121960 -0.209361 -0.172460 -0.143816 -0.166007 0.080688 0.098870 0.092293 0.102710 0.093591 0.070127 0.101178 0.103507 0.129597 0.142237 0.154222 0.149275 0.151576 0.157112 0.148918 0.160059 0.157918 0.158161
qa: -0.0545 -0.0592 -0.2089 -0.2920 -0.4318 -0.3296 -0.0883 0.1230 0.0209 -0.0928 -0.2709 -0.2567 -0.2027 0.3903 0.0415 0.4074 0.0234 -0.2190 -0.1295 -0.2191 0.1449 -0.1605 0.2084 0.2174 -0.1220 -0.2094 -0.1725 -0.1438 -0.1660 0.0807 0.0989 0.0923 0.1027 0.0936 0.0701 0.1012 0.1035 0.1296 0.1422 0.1542 0.1493 0.1516 0.1571 0.1489 0.1601 0.1579 0.1582
va: 1.2711 1.2458 1.0836 2.1064 2.0856 2.0726 3.1089 3.6825 3.9093 3.8467 3.9162 3.8909 3.9054 4.1783 4.2134 3.6793 3.6991 4.0420 3.8922 3.9659 3.7487 3.8879 4.0708 3.7413 3.8290 3.9760 3.8547 3.8713 3.8365 1.0486 1.0339 1.0019 1.0004 1.0063 1.0160 1.0219 1.0017 1.0188 1.0292 1.0081 1.0023 0.9976 0.9956 1.0047 0.9912 0.9893 0.9901
dispcorr: -0.026109840 hartree
energy: -2149.963471653682
dipole: 0.75260 -1.82106 -1.06847 -24.50350 23.12246 -1.38105 11.10501 -10.11300 0.99201
magnitude: 2.00823 au
magnitude: 5.10452 debye
