program: Orca
programVersion: 5.0.2
elementType: Cl Cl F O O O N C C C C C C C C C C C C C C C C C C C C C C H H H H H H H H H H H H H H H H H H
charge: 0
multiplicity: 1
keywords: wb97x-d3
keywords: def2-TZVPP
keywords: def2/J RIJCOSX
keywords: DEFGRID2
keywords: scfconv7
keywords: smallprint printgap noloewdin
keywords: NOSOSCF
formula: C22H18Cl2FNO3
InChI: InChI=1/C22H18Cl2FNO3/c1-22(2)15(11-19(23)24)20(22)21(27)29-18(12-26)13-8-9-16(25)17(10-13)28-14-6-4-3-5-7-14/h3-11,15,18,20H,1-2H3
47 atoms
Cl -2.599808 0.966883 -2.174721
Cl -5.368942 0.621699 -1.421347
F  4.931558 -3.138838 1.36703
O  0.871569 1.35989 0.182929
O  0.420922 3.378843 -0.653466
O  2.521131 -3.454508 0.338194
N  2.091803 1.402972 -2.986739
C  -1.916107 3.22466 1.499174
C  -2.434249 2.991193 0.123095
C  -1.244941 2.190942 0.602617
C  -2.670267 2.648943 2.672165
C  -1.232183 4.532821 1.805161
C  -3.713045 2.291614 -0.130935
C  0.065893 2.415825 -0.022891
C  -3.872741 1.410138 -1.107399
C  2.176442 1.408522 -0.370211
C  2.921973 0.186093 0.101995
C  2.106141 1.422448 -1.838375
C  2.332594 -1.068587 -0.017946
C  4.190713 0.317366 0.64292
C  3.006769 -2.191889 0.428231
C  4.883863 -0.809302 1.064951
C  4.284682 -2.043495 0.95957
C  1.179029 -3.688176 0.507131
C  0.4434 -3.072105 1.511654
C  0.593259 -4.617014 -0.338876
C  -0.900746 -3.386301 1.650454
C  -0.748915 -4.930981 -0.178415
C  -1.502394 -4.312798 0.809304
H  -2.192373 3.764618 -0.602181
H  -1.435442 1.160454 0.880468
H  -1.999951 2.49748 3.519683
H  -3.459624 3.331422 2.993511
H  -3.132844 1.688019 2.443874
H  -0.473293 4.405535 2.579065
H  -0.756586 4.982583 0.936132
H  -1.96635 5.248718 2.179702
H  -4.570236 2.526456 0.489919
H  2.705785 2.314055 -0.056851
H  1.348436 -1.174432 -0.458823
H  4.647721 1.293692 0.738216
H  5.875844 -0.724726 1.489101
H  0.904483 -2.358352 2.182916
H  1.184278 -5.090764 -1.112495
H  -1.477839 -2.904726 2.429243
H  -1.206141 -5.657552 -0.837437
H  -2.550888 -4.553168 0.925751
elementType: Cl F O N C H
totalener: -2149.93744856 hartree
nucrepener: 2985.47402875 hartree
electener: -5135.41147731 hartree
oneelecener: -8884.49337720 hartree
twoeener: 3749.08189990 hartree
cpcmener: -0.03441169 hartree
kineticenergy: 2143.47703991 hartree
xcener: -159.161453542208 hartree
chargesum: -0.0000000
charge: -0.049367 -0.055019 -0.207028 -0.278389 -0.439272 -0.323608 -0.087097 0.127836 -0.033225 -0.129036 -0.279146 -0.269149 -0.215972 0.396676 0.076038 0.422877 -0.018031 -0.234690 -0.163842 -0.168292 0.171660 -0.162599 0.201142 0.273843 -0.182991 -0.244286 -0.146420 -0.119834 -0.181260 0.113721 0.113968 0.100335 0.102169 0.094125 0.100891 0.095127 0.097163 0.140491 0.130237 0.147619 0.148961 0.151372 0.157797 0.148035 0.159491 0.158723 0.158254
qa: -0.0494 -0.0550 -0.2070 -0.2784 -0.4393 -0.3236 -0.0871 0.1278 -0.0332 -0.1290 -0.2791 -0.2691 -0.2160 0.3967 0.0760 0.4229 -0.0180 -0.2347 -0.1638 -0.1683 0.1717 -0.1626 0.2011 0.2738 -0.1830 -0.2443 -0.1464 -0.1198 -0.1813 0.1137 0.1140 0.1003 0.1022 0.0941 0.1009 0.0951 0.0972 0.1405 0.1302 0.1476 0.1490 0.1514 0.1578 0.1480 0.1595 0.1587 0.1583
va: 1.2835 1.2511 1.0860 2.1537 2.0659 2.0838 3.1126 3.7247 3.8784 3.8420 3.9156 3.8927 3.9048 4.1507 4.1849 3.7418 3.7728 4.0184 3.9295 3.9088 3.7684 3.8916 4.0628 3.7039 3.9090 4.0091 3.8896 3.8855 3.9058 1.0229 1.0175 1.0029 0.9997 0.9990 0.9994 1.0162 1.0014 1.0079 1.0202 1.0178 1.0008 0.9982 0.9954 1.0068 0.9904 0.9889 0.9903
dispcorr: -0.024502843 hartree
energy: -2149.961951403374
dipole: -1.47401 0.62672 -0.84729 11.29547 -10.63637 0.65910 22.98027 -19.87134 3.10893
magnitude: 3.28903 au
magnitude: 8.36006 debye
