program: Orca
programVersion: 5.0.2
elementType: Cl Cl F O O O N C C C C C C C C C C C C C C C C C C C C C C H H H H H H H H H H H H H H H H H H
charge: 0
multiplicity: 1
keywords: wb97x-d3
keywords: def2-TZVPP
keywords: def2/J RIJCOSX
keywords: DEFGRID2
keywords: scfconv7
keywords: smallprint printgap noloewdin
keywords: NOSOSCF
formula: C22H18Cl2FNO3
InChI: InChI=1/C22H18Cl2FNO3/c1-22(2)15(11-19(23)24)20(22)21(27)29-18(12-26)13-8-9-16(25)17(10-13)28-14-6-4-3-5-7-14/h3-11,15,18,20H,1-2H3
47 atoms
Cl -2.881703 -0.474992 -2.494087
Cl -4.907767 -0.850828 -0.47551
F  3.86573 -2.991449 -1.265811
O  1.20381 2.086819 1.280846
O  1.051563 2.271958 -0.936977
O  2.111387 -2.961973 0.699739
N  3.759003 4.023476 0.193479
C  -1.816348 3.349301 -0.293785
C  -1.90639 1.900671 -0.668254
C  -0.930655 2.341001 0.412715
C  -2.897872 3.975523 0.555027
C  -1.246918 4.305719 -1.313453
C  -3.051297 1.067916 -0.285594
C  0.510566 2.234367 0.136991
C  -3.540139 0.059394 -0.996263
C  2.605926 1.891826 1.175862
C  2.97268 0.602192 0.474309
C  3.247491 3.074519 0.589869
C  2.35512 -0.562424 0.920709
C  3.901879 0.54743 -0.552318
C  2.643654 -1.775405 0.318411
C  4.219085 -0.670627 -1.137331
C  3.584013 -1.81163 -0.705262
C  0.816335 -3.036532 1.144139
C  0.574009 -3.893677 2.207544
C  -0.222895 -2.347473 0.529976
C  -0.725158 -4.061891 2.664643
C  -1.514792 -2.518771 1.006291
C  -1.773219 -3.370932 2.071616
H  -1.438606 1.650566 -1.613715
H  -1.212452 2.119042 1.435585
H  -3.235278 3.335489 1.36956
H  -2.531946 4.900551 1.003712
H  -3.766416 4.226178 -0.056867
H  -0.706447 5.119271 -0.826023
H  -0.575792 3.83185 -2.025261
H  -2.064745 4.750362 -1.883426
H  -3.548355 1.285662 0.652264
H  2.945345 1.844486 2.214349
H  1.643488 -0.528087 1.737034
H  4.390271 1.441824 -0.916125
H  4.942774 -0.726117 -1.940183
H  1.396441 -4.428116 2.667523
H  -0.041804 -1.690467 -0.312321
H  -0.913136 -4.73322 3.492833
H  -2.327688 -1.98464 0.532442
H  -2.785311 -3.498391 2.432443
elementType: Cl F O N C H
totalener: -2149.93713621 hartree
nucrepener: 3058.95726245 hartree
electener: -5208.89439866 hartree
oneelecener: -9031.06031873 hartree
twoeener: 3822.16592007 hartree
cpcmener: -0.03298807 hartree
kineticenergy: 2143.45820395 hartree
xcener: -159.163576741613 hartree
chargesum: -0.0000000
charge: -0.056797 -0.068375 -0.208931 -0.289877 -0.437035 -0.323419 -0.077033 0.084197 0.037993 -0.070900 -0.272042 -0.267729 -0.225941 0.405314 0.071279 0.508480 -0.052887 -0.260127 -0.238583 -0.164221 0.210432 -0.154755 0.193826 0.306096 -0.257441 -0.238802 -0.096163 -0.074027 -0.231732 0.083710 0.096886 0.092415 0.099807 0.103522 0.101062 0.096483 0.098093 0.128450 0.145243 0.148097 0.135347 0.151204 0.146034 0.148844 0.157661 0.162573 0.153770
qa: -0.0568 -0.0684 -0.2089 -0.2899 -0.4370 -0.3234 -0.0770 0.0842 0.0380 -0.0709 -0.2720 -0.2677 -0.2259 0.4053 0.0713 0.5085 -0.0529 -0.2601 -0.2386 -0.1642 0.2104 -0.1548 0.1938 0.3061 -0.2574 -0.2388 -0.0962 -0.0740 -0.2317 0.0837 0.0969 0.0924 0.0998 0.1035 0.1011 0.0965 0.0981 0.1285 0.1452 0.1481 0.1353 0.1512 0.1460 0.1488 0.1577 0.1626 0.1538
va: 1.2652 1.2345 1.0829 2.1278 2.0710 2.0904 3.1068 3.7691 3.8396 3.8550 3.9117 3.9047 3.9353 4.1454 4.1849 3.8069 3.7639 4.0922 3.9546 3.8849 3.7235 3.9092 4.0644 3.7038 4.0156 3.9461 3.8691 3.7902 3.9777 1.0479 1.0331 1.0060 1.0010 0.9997 0.9998 1.0188 0.9999 1.0197 0.9884 1.0119 1.0157 0.9983 1.0077 1.0070 0.9887 0.9823 0.9952
dispcorr: -0.027028288 hartree
energy: -2149.964164500534
dipole: -2.37487 0.88868 -1.48619 20.23307 -19.97305 0.26002 12.73049 -10.66419 2.06630
magnitude: 2.55851 au
magnitude: 6.50321 debye
