program: Orca
programVersion: 5.0.2
elementType: Cl Cl F O O O N C C C C C C C C C C C C C C C C C C C C C C H H H H H H H H H H H H H H H H H H
charge: 0
multiplicity: 1
keywords: wb97x-d3
keywords: def2-TZVPP
keywords: def2/J RIJCOSX
keywords: DEFGRID2
keywords: scfconv7
keywords: smallprint printgap noloewdin
keywords: NOSOSCF
formula: C22H18Cl2FNO3
InChI: InChI=1/C22H18Cl2FNO3/c1-22(2)15(11-19(23)24)20(22)21(27)29-18(12-26)13-8-9-16(25)17(10-13)28-14-6-4-3-5-7-14/h3-11,15,18,20H,1-2H3
47 atoms
Cl -3.445139 -0.181271 -1.696274
Cl -4.87989 -0.978798 0.677962
F  4.657985 -2.957603 1.03185
O  0.99779 2.008558 -0.22993
O  1.431329 2.389584 1.925391
O  2.072319 -2.879695 0.630881
N  2.617946 2.152409 -3.092329
C  -1.785505 3.15352 0.482529
C  -1.810726 1.67037 0.237473
C  -0.830164 2.248642 1.237861
C  -2.878242 3.790011 1.306625
C  -1.293362 4.046734 -0.630582
C  -2.895718 0.817031 0.745095
C  0.630702 2.232457 1.040524
C  -3.632034 -0.000456 0.003726
C  2.384455 1.923499 -0.498949
C  2.990677 0.608134 -0.058112
C  2.495567 2.056214 -1.954857
C  2.189422 -0.521796 0.065122
C  4.352856 0.539409 0.180136
C  2.754957 -1.727229 0.446436
C  4.927531 -0.672122 0.542248
C  4.128128 -1.783026 0.67259
C  0.723274 -2.912499 0.35268
C  -0.177981 -2.808347 1.399807
C  0.295351 -3.094324 -0.95407
C  -1.537203 -2.903981 1.131424
C  -1.065445 -3.182359 -1.209213
C  -1.982233 -3.092112 -0.169954
H  -1.39026 1.36597 -0.713809
H  -1.082509 2.111305 2.283743
H  -2.546157 4.755014 1.693659
H  -3.763439 3.9662 0.692324
H  -3.180016 3.182858 2.159686
H  -0.779198 4.921931 -0.228496
H  -0.621261 3.547934 -1.325017
H  -2.145803 4.405369 -1.210409
H  -3.118459 0.853198 1.804916
H  2.931687 2.758441 -0.04808
H  1.126172 -0.467712 -0.129365
H  4.973907 1.420997 0.086316
H  5.990777 -0.748005 0.729844
H  0.179296 -2.662849 2.412049
H  1.015873 -3.1700 -1.759571
H  -2.247743 -2.829703 1.944858
H  -1.409301 -3.325301 -2.225682
H  -3.041005 -3.171414 -0.37559
elementType: Cl F O N C H
totalener: -2149.93599712 hartree
nucrepener: 3105.63370121 hartree
electener: -5255.56969833 hartree
oneelecener: -9124.21187234 hartree
twoeener: 3868.64217401 hartree
cpcmener: -0.03308652 hartree
kineticenergy: 2143.46314400 hartree
xcener: -159.162873071364 hartree
chargesum: -0.0000000
charge: -0.056198 -0.059373 -0.210541 -0.281566 -0.427959 -0.321638 -0.084141 0.102601 0.055788 -0.098105 -0.263583 -0.269935 -0.238795 0.390293 0.056445 0.356791 -0.004771 -0.227663 -0.159738 -0.217730 0.221934 -0.139103 0.188344 0.212814 -0.160857 -0.153972 -0.171550 -0.166645 -0.133329 0.091536 0.097259 0.100166 0.101261 0.089845 0.103737 0.094335 0.096937 0.134733 0.148721 0.139796 0.146281 0.150682 0.150843 0.152353 0.151217 0.157355 0.155128
qa: -0.0562 -0.0594 -0.2105 -0.2816 -0.4280 -0.3216 -0.0841 0.1026 0.0558 -0.0981 -0.2636 -0.2699 -0.2388 0.3903 0.0564 0.3568 -0.0048 -0.2277 -0.1597 -0.2177 0.2219 -0.1391 0.1883 0.2128 -0.1609 -0.1540 -0.1715 -0.1666 -0.1333 0.0915 0.0973 0.1002 0.1013 0.0898 0.1037 0.0943 0.0969 0.1347 0.1487 0.1398 0.1463 0.1507 0.1508 0.1524 0.1512 0.1574 0.1551
va: 1.2667 1.2463 1.0792 2.1044 2.0817 2.0900 3.1106 3.7327 3.7876 3.8986 3.9133 3.9175 3.8747 4.1607 4.2008 3.7592 3.7277 4.0538 3.9077 3.9704 3.7114 3.8760 4.0528 3.7459 3.9724 3.9481 3.8442 3.9215 3.7928 1.0360 1.0312 1.0016 1.0008 1.0049 0.9994 1.0101 1.0011 1.0148 1.0153 1.0198 1.0008 0.9974 1.0005 0.9986 0.9998 0.9937 1.0056
dispcorr: -0.029128327 hartree
energy: -2149.965125452094
dipole: -1.26014 0.10653 -1.15360 20.84971 -19.61902 1.23070 4.76558 -3.76322 1.00237
magnitude: 1.96218 au
magnitude: 4.98747 debye
