program: Orca
programVersion: 5.0.2
elementType: Cl Cl F O O O N C C C C C C C C C C C C C C C C C C C C C C H H H H H H H H H H H H H H H H H H
charge: 0
multiplicity: 1
keywords: wb97x-d3
keywords: def2-TZVPP
keywords: def2/J RIJCOSX
keywords: DEFGRID2
keywords: scfconv7
keywords: smallprint printgap noloewdin
keywords: NOSOSCF
formula: C22H18Cl2FNO3
InChI: InChI=1/C22H18Cl2FNO3/c1-22(2)15(11-19(23)24)20(22)21(27)29-18(12-26)13-8-9-16(25)17(10-13)28-14-6-4-3-5-7-14/h3-11,15,18,20H,1-2H3
47 atoms
Cl -4.05716 5.084023 1.093523
Cl -3.718228 6.66132 -1.296876
F  2.27134 -4.630163 -1.238271
O  0.70072 1.337757 -0.478244
O  -0.892811 0.946409 1.04777
O  1.087106 -4.067855 1.15547
N  3.865744 2.109383 0.025311
C  -2.818705 1.526127 -1.360783
C  -2.666531 2.789437 -0.566569
C  -1.429886 2.032153 -1.024726
C  -3.194663 1.587149 -2.821677
C  -3.402338 0.325111 -0.657488
C  -2.906617 4.115412 -1.147726
C  -0.565569 1.383514 -0.026762
C  -3.475147 5.140223 -0.525231
C  1.684023 0.705199 0.337013
C  1.880121 -0.729127 -0.079717
C  2.903935 1.491787 0.151589
C  1.444052 -1.748851 0.756698
C  2.45376 -1.032058 -1.308916
C  1.575535 -3.069509 0.363366
C  2.593325 -2.351461 -1.70636
C  2.14836 -3.352523 -0.869783
C  1.954854 -5.027423 1.626084
C  3.311389 -4.792433 1.799611
C  1.395452 -6.253759 1.957677
C  4.11354 -5.811596 2.297016
C  2.20927 -7.258133 2.458858
C  3.57188 -7.045812 2.625728
H  -2.897078 2.686907 0.487869
H  -0.894683 2.469561 -1.859383
H  -2.911504 0.656877 -3.316536
H  -4.273459 1.706992 -2.9326
H  -2.707812 2.40098 -3.356868
H  -2.969601 -0.599828 -1.041985
H  -3.264876 0.343912 0.42063
H  -4.476259 0.288969 -0.846731
H  -2.586769 4.283699 -2.169259
H  1.420185 0.761547 1.396842
H  0.99784 -1.523904 1.717693
H  2.799794 -0.245807 -1.968242
H  3.037759 -2.602018 -2.660367
H  3.750472 -3.832126 1.559556
H  0.3346 -6.419481 1.819211
H  5.172117 -5.630563 2.429537
H  1.773252 -8.215643 2.711845
H  4.204249 -7.834699 3.010082
elementType: Cl F O N C H
totalener: -2149.92503510 hartree
nucrepener: 2821.63806108 hartree
electener: -4971.56309618 hartree
oneelecener: -8556.38189654 hartree
twoeener: 3584.81880036 hartree
cpcmener: -0.03718691 hartree
kineticenergy: 2143.44146759 hartree
xcener: -159.154731790343 hartree
chargesum: -0.0000000
charge: -0.056663 -0.060788 -0.208248 -0.282047 -0.471890 -0.334093 -0.102376 0.090185 0.029051 -0.090561 -0.264850 -0.270612 -0.195835 0.428803 0.036090 0.419756 -0.023280 -0.217982 -0.157529 -0.171515 0.135550 -0.174843 0.283362 0.264017 -0.163399 -0.239331 -0.167502 -0.130603 -0.183229 0.082154 0.097846 0.099690 0.100952 0.092562 0.102651 0.094132 0.099193 0.133879 0.134576 0.142797 0.151339 0.156230 0.157611 0.149306 0.162337 0.161141 0.161967
qa: -0.0567 -0.0608 -0.2082 -0.2820 -0.4719 -0.3341 -0.1024 0.0902 0.0291 -0.0906 -0.2649 -0.2706 -0.1958 0.4288 0.0361 0.4198 -0.0233 -0.2180 -0.1575 -0.1715 0.1356 -0.1748 0.2834 0.2640 -0.1634 -0.2393 -0.1675 -0.1306 -0.1832 0.0822 0.0978 0.0997 0.1010 0.0926 0.1027 0.0941 0.0992 0.1339 0.1346 0.1428 0.1513 0.1562 0.1576 0.1493 0.1623 0.1611 0.1620
va: 1.2689 1.2440 1.0827 2.1307 2.0374 2.0606 3.1072 3.7251 3.8809 3.8616 3.9103 3.9047 3.8934 4.1502 4.2110 3.7018 3.6792 4.0878 3.9793 3.9555 3.7856 3.9332 3.9808 3.6741 3.8588 3.9870 3.9095 3.8956 3.8897 1.0442 1.0345 1.0008 1.0011 1.0056 0.9987 1.0181 1.0002 1.0170 1.0221 1.0182 1.0045 0.9975 0.9992 1.0072 0.9898 0.9879 0.9888
dispcorr: -0.022925372 hartree
energy: -2149.947960473783
dipole: 5.52181 -6.02828 -0.50647 -30.83741 29.60654 -1.23086 -3.48044 2.22344 -1.25701
magnitude: 1.83074 au
magnitude: 4.65337 debye
