program: Orca
programVersion: 5.0.2
elementType: Cl Cl F O O O N C C C C C C C C C C C C C C C C C C C C C C H H H H H H H H H H H H H H H H H H
charge: 0
multiplicity: 1
keywords: wb97x-d3
keywords: def2-TZVPP
keywords: def2/J RIJCOSX
keywords: DEFGRID2
keywords: scfconv7
keywords: smallprint printgap noloewdin
keywords: NOSOSCF
formula: C22H18Cl2FNO3
InChI: InChI=1/C22H18Cl2FNO3/c1-22(2)15(11-19(23)24)20(22)21(27)29-18(12-26)13-8-9-16(25)17(10-13)28-14-6-4-3-5-7-14/h3-11,15,18,20H,1-2H3
47 atoms
Cl -3.465112 5.164348 0.940554
Cl -5.157849 4.885648 -1.37846
F  4.010594 -3.108409 2.096844
O  0.759193 0.979595 -1.375261
O  0.579108 2.002392 0.604621
O  2.685714 -3.755301 -0.191624
N  3.130838 0.691725 -3.653224
C  -2.362148 0.870429 0.400532
C  -2.339329 2.341627 0.10698
C  -1.3900 1.415405 -0.62989
C  -3.477606 0.010271 -0.142135
C  -1.878527 0.419726 1.756688
C  -3.398597 2.99869 -0.667553
C  0.052955 1.516235 -0.364895
C  -3.926534 4.185495 -0.397981
C  2.176992 0.991287 -1.238479
C  2.672349 -0.110566 -0.336564
C  2.694072 0.821082 -2.597387
C  2.409246 -1.438843 -0.658605
C  3.371628 0.200485 0.819274
C  2.865724 -2.449272 0.163903
C  3.828377 -0.809842 1.653752
C  3.573561 -2.119317 1.31471
C  1.850989 -4.548135 0.558758
C  1.965117 -5.917038 0.351452
C  0.917891 -4.039519 1.451163
C  1.136584 -6.78189 1.048192
C  0.098797 -4.921917 2.14515
C  0.201346 -6.291192 1.951131
H  -1.875681 2.945892 0.878448
H  -1.6433 1.185137 -1.658245
H  -3.759384 0.266835 -1.162289
H  -3.175431 -1.038004 -0.14031
H  -4.365549 0.100082 0.485815
H  -1.407991 -0.563162 1.694427
H  -1.171328 1.107308 2.214523
H  -2.731517 0.334067 2.431509
H  -3.778605 2.482422 -1.54092
H  2.531507 1.961864 -0.878028
H  1.863915 -1.702319 -1.557505
H  3.571352 1.232643 1.07411
H  4.379618 -0.581456 2.556186
H  2.696313 -6.298105 -0.350006
H  0.808936 -2.973721 1.608152
H  1.22723 -7.847647 0.884488
H  -0.628868 -4.525119 2.840624
H  -0.44169 -6.970076 2.494734
elementType: Cl F O N C H
totalener: -2149.92618669 hartree
nucrepener: 2887.80414929 hartree
electener: -5037.73033599 hartree
oneelecener: -8688.44945009 hartree
twoeener: 3650.71911410 hartree
cpcmener: -0.03840154 hartree
kineticenergy: 2143.45131151 hartree
xcener: -159.157309740573 hartree
chargesum: -0.0000000
charge: -0.056938 -0.061337 -0.208074 -0.284519 -0.467258 -0.332172 -0.100696 0.087309 0.036006 -0.083557 -0.263855 -0.267684 -0.203796 0.414574 0.038324 0.436316 -0.037809 -0.225042 -0.172503 -0.137689 0.133390 -0.172597 0.263524 0.287730 -0.248311 -0.178581 -0.124156 -0.169377 -0.188640 0.081005 0.100248 0.093037 0.098771 0.101981 0.100817 0.093950 0.100853 0.134777 0.141594 0.143881 0.152923 0.155712 0.147990 0.156739 0.160357 0.161919 0.160865
qa: -0.0569 -0.0613 -0.2081 -0.2845 -0.4673 -0.3322 -0.1007 0.0873 0.0360 -0.0836 -0.2639 -0.2677 -0.2038 0.4146 0.0383 0.4363 -0.0378 -0.2250 -0.1725 -0.1377 0.1334 -0.1726 0.2635 0.2877 -0.2483 -0.1786 -0.1242 -0.1694 -0.1886 0.0810 0.1002 0.0930 0.0988 0.1020 0.1008 0.0939 0.1009 0.1348 0.1416 0.1439 0.1529 0.1557 0.1480 0.1567 0.1604 0.1619 0.1609
va: 1.2684 1.2437 1.0846 2.1358 2.0445 2.0659 3.1105 3.7339 3.8679 3.8614 3.9081 3.9073 3.8939 4.1592 4.2095 3.7033 3.6334 4.0795 4.0221 3.9091 3.7946 3.9181 3.9974 3.6672 3.9843 3.8599 3.8938 3.9139 3.8971 1.0477 1.0326 1.0051 1.0015 1.0007 0.9991 1.0172 1.0003 1.0164 1.0145 1.0197 1.0030 0.9969 1.0083 1.0016 0.9880 0.9901 0.9891
dispcorr: -0.023872544 hartree
energy: -2149.950059236543
dipole: 0.41856 -1.57906 -1.16050 -29.88296 29.22945 -0.65351 8.21645 -6.98217 1.23428
magnitude: 1.81584 au
magnitude: 4.61551 debye
