program: Orca
programVersion: 5.0.2
elementType: Cl Cl F O O O N C C C C C C C C C C C C C C C C C C C C C C H H H H H H H H H H H H H H H H H H
charge: 0
multiplicity: 1
keywords: wb97x-d3
keywords: def2-TZVPP
keywords: def2/J RIJCOSX
keywords: DEFGRID2
keywords: scfconv7
keywords: smallprint printgap noloewdin
keywords: NOSOSCF
formula: C22H18Cl2FNO3
InChI: InChI=1/C22H18Cl2FNO3/c1-22(2)15(11-19(23)24)20(22)21(27)29-18(12-26)13-8-9-16(25)17(10-13)28-14-6-4-3-5-7-14/h3-11,15,18,20H,1-2H3
47 atoms
Cl -1.65042 -0.336539 2.028546
Cl -4.421951 -0.990597 1.569064
F  4.232645 -3.206477 -0.711527
O  0.895329 2.024693 -0.131359
O  0.630065 3.282126 1.701803
O  1.68873 -2.887822 -0.060964
N  3.242186 3.690258 -1.775863
C  -1.988196 2.975465 -0.76595
C  -1.898492 1.534643 -0.397324
C  -1.294832 2.564925 0.529357
C  -3.302296 3.692478 -0.576692
C  -1.195991 3.486486 -1.943301
C  -3.081449 0.767828 0.052263
C  0.150705 2.678244 0.774506
C  -3.055166 -0.071605 1.076635
C  2.301025 2.011868 -0.002134
C  2.820021 0.604624 -0.222984
C  2.834815 2.947423 -0.998138
C  1.970919 -0.478791 -0.043778
C  4.15517 0.399357 -0.543547
C  2.445078 -1.770006 -0.224291
C  4.640035 -0.890279 -0.697625
C  3.782232 -1.957383 -0.548319
C  0.332633 -2.843902 -0.307159
C  -0.492366 -3.492625 0.596677
C  -0.189346 -2.227251 -1.436939
C  -1.861811 -3.516607 0.371259
C  -1.561169 -2.24854 -1.641783
C  -2.402109 -2.890064 -0.741761
H  -1.188327 0.945639 -0.973092
H  -1.862507 2.797016 1.423244
H  -3.943261 3.54732 -1.448153
H  -3.846736 3.344381 0.301397
H  -3.137807 4.764661 -0.460758
H  -0.890611 4.521918 -1.784639
H  -0.306003 2.898754 -2.157119
H  -1.821428 3.462616 -2.837227
H  -4.007132 0.867003 -0.502818
H  2.613051 2.370612 0.983961
H  0.936594 -0.330996 0.235691
H  4.833025 1.233094 -0.674701
H  5.678124 -1.064717 -0.947699
H  -0.068701 -3.969718 1.471182
H  0.456763 -1.73441 -2.152402
H  -2.507212 -4.018336 1.079914
H  -1.971161 -1.761967 -2.517028
H  -3.470743 -2.898848 -0.907479
elementType: Cl F O N C H
totalener: -2149.91952904 hartree
nucrepener: 3168.23379598 hartree
electener: -5318.15332502 hartree
oneelecener: -9248.92574691 hartree
twoeener: 3930.77242188 hartree
cpcmener: -0.03608888 hartree
kineticenergy: 2143.46043817 hartree
xcener: -159.167924835171 hartree
chargesum: 0.0000000
charge: -0.054577 -0.064933 -0.212685 -0.269173 -0.461338 -0.335663 -0.100232 0.142872 0.007154 -0.160946 -0.287470 -0.273099 -0.290397 0.441604 0.153348 0.386223 0.004731 -0.207515 -0.153367 -0.214307 0.254916 -0.150763 0.174664 0.313373 -0.249137 -0.199044 -0.134309 -0.167640 -0.158211 0.112554 0.115395 0.102629 0.095830 0.100997 0.104595 0.088574 0.098252 0.139060 0.139455 0.085906 0.145161 0.152845 0.146713 0.161190 0.154941 0.163664 0.158159
qa: -0.0546 -0.0649 -0.2127 -0.2692 -0.4613 -0.3357 -0.1002 0.1429 0.0072 -0.1609 -0.2875 -0.2731 -0.2904 0.4416 0.1533 0.3862 0.0047 -0.2075 -0.1534 -0.2143 0.2549 -0.1508 0.1747 0.3134 -0.2491 -0.1990 -0.1343 -0.1676 -0.1582 0.1126 0.1154 0.1026 0.0958 0.1010 0.1046 0.0886 0.0983 0.1391 0.1395 0.0859 0.1452 0.1528 0.1467 0.1612 0.1549 0.1637 0.1582
va: 1.2777 1.2412 1.0770 2.1080 2.0460 2.0777 3.1012 3.7389 3.7967 3.8879 3.9188 3.8946 3.9163 4.0920 4.1197 3.6881 3.7950 4.0339 3.9099 3.9447 3.6540 3.8866 4.0727 3.6295 3.9797 3.8746 3.8435 3.8410 3.7894 1.0077 1.0221 0.9995 0.9990 1.0021 0.9987 1.0129 1.0023 1.0133 1.0267 1.0448 1.0063 0.9974 1.0059 0.9931 0.9945 0.9892 0.9952
dispcorr: -0.031765113 hartree
energy: -2149.951294155196
dipole: -8.84355 7.06969 -1.77386 18.46238 -18.59513 -0.13276 -15.56603 14.98388 -0.58215
magnitude: 1.87166 au
magnitude: 4.75737 debye
