program: Orca
programVersion: 5.0.2
elementType: Cl Cl F O O O N C C C C C C C C C C C C C C C C C C C C C C H H H H H H H H H H H H H H H H H H
charge: 0
multiplicity: 1
keywords: wb97x-d3
keywords: def2-TZVPP
keywords: def2/J RIJCOSX
keywords: DEFGRID2
keywords: scfconv7
keywords: smallprint printgap noloewdin
keywords: NOSOSCF
formula: C22H18Cl2FNO3
InChI: InChI=1/C22H18Cl2FNO3/c1-22(2)15(11-19(23)24)20(22)21(27)29-18(12-26)13-8-9-16(25)17(10-13)28-14-6-4-3-5-7-14/h3-11,15,18,20H,1-2H3
47 atoms
Cl -1.969356 4.11547 0.826527
Cl -4.380473 5.153274 -0.375966
F  3.423726 -3.931241 -1.668308
O  0.787036 1.462469 -0.347948
O  -0.414616 0.169174 1.029469
O  2.53254 -3.757818 0.843335
N  3.680481 3.020566 -0.108782
C  -2.576148 0.341588 -1.232962
C  -2.871706 1.372349 -0.20241
C  -1.478578 1.30431 -0.791713
C  -3.070883 0.558153 -2.642698
C  -2.549726 -1.10959 -0.820827
C  -3.709054 2.558307 -0.485934
C  -0.361283 0.898689 0.069936
C  -3.398451 3.776332 -0.067539
C  1.983559 1.08329 0.331128
C  2.481122 -0.241283 -0.184235
C  2.928539 2.169378 0.07101
C  2.339554 -1.36611 0.613629
C  2.977099 -0.358799 -1.478445
C  2.654867 -2.617065 0.108667
C  3.322092 -1.603235 -1.977835
C  3.136853 -2.719385 -1.187185
C  1.34843 -3.994662 1.503168
C  1.430923 -4.729876 2.676559
C  0.121039 -3.563384 1.015575
C  0.268731 -5.040281 3.367666
C  -1.031394 -3.874304 1.724385
C  -0.965835 -4.610436 2.899614
H  -2.949923 1.000596 0.816828
H  -1.230486 2.067821 -1.519733
H  -3.03406 1.605668 -2.943795
H  -2.465462 -0.010961 -3.349882
H  -4.103393 0.217246 -2.740591
H  -2.347672 -1.2507 0.238278
H  -3.523028 -1.558411 -1.027089
H  -1.804351 -1.666529 -1.391562
H  -4.63181 2.426508 -1.039163
H  1.830013 1.042329 1.41387
H  1.967112 -1.274656 1.626367
H  3.096523 0.513544 -2.108667
H  3.709102 -1.71164 -2.982312
H  2.395704 -5.057314 3.042803
H  0.048068 -2.99672 0.095634
H  0.334164 -5.615657 4.281785
H  -1.98774 -3.538061 1.344452
H  -1.86919 -4.849357 3.44447
elementType: Cl F O N C H
totalener: -2149.92250994 hartree
nucrepener: 2996.23681532 hartree
electener: -5146.15932526 hartree
oneelecener: -8905.66973243 hartree
twoeener: 3759.51040717 hartree
cpcmener: -0.03658167 hartree
kineticenergy: 2143.46622405 hartree
xcener: -159.160528721977 hartree
chargesum: 0.0000000
charge: -0.052329 -0.056326 -0.208620 -0.275335 -0.472162 -0.340237 -0.100101 0.158541 -0.026245 -0.156357 -0.280008 -0.295872 -0.220241 0.429805 0.078438 0.408021 -0.019158 -0.216219 -0.156524 -0.185629 0.196084 -0.172569 0.213890 0.285818 -0.245657 -0.193073 -0.126694 -0.153888 -0.189709 0.116636 0.117310 0.095266 0.100384 0.102982 0.084735 0.102370 0.107338 0.142738 0.139757 0.154754 0.148416 0.155897 0.148504 0.166818 0.161375 0.165427 0.161651
qa: -0.0523 -0.0563 -0.2086 -0.2753 -0.4722 -0.3402 -0.1001 0.1585 -0.0262 -0.1564 -0.2800 -0.2959 -0.2202 0.4298 0.0784 0.4080 -0.0192 -0.2162 -0.1565 -0.1856 0.1961 -0.1726 0.2139 0.2858 -0.2457 -0.1931 -0.1267 -0.1539 -0.1897 0.1166 0.1173 0.0953 0.1004 0.1030 0.0847 0.1024 0.1073 0.1427 0.1398 0.1548 0.1484 0.1559 0.1485 0.1668 0.1614 0.1654 0.1617
va: 1.2796 1.2504 1.0844 2.1253 2.0310 2.0746 3.1103 3.6906 3.8712 3.8636 3.9173 3.8976 3.9116 4.1027 4.1799 3.7411 3.6433 4.0672 3.9131 3.9532 3.7003 3.8921 4.0849 3.7054 3.9932 3.8719 3.8911 3.8857 3.9209 1.0184 1.0231 0.9992 1.0025 0.9997 1.0138 1.0035 0.9949 1.0079 1.0160 1.0107 1.0054 0.9962 1.0067 0.9887 0.9874 0.9884 0.9897
dispcorr: -0.026816336 hartree
energy: -2149.949326272283
dipole: -8.81030 6.68697 -2.12334 -27.57724 26.47734 -1.09991 -3.01499 2.26419 -0.75080
magnitude: 2.50641 au
magnitude: 6.37078 debye
