program: Orca
programVersion: 5.0.2
elementType: Cl Cl F O O O N C C C C C C C C C C C C C C C C C C C C C C H H H H H H H H H H H H H H H H H H
charge: 0
multiplicity: 1
keywords: wb97x-d3
keywords: def2-TZVPP
keywords: def2/J RIJCOSX
keywords: DEFGRID2
keywords: scfconv7
keywords: smallprint printgap noloewdin
keywords: NOSOSCF
formula: C22H18Cl2FNO3
InChI: InChI=1/C22H18Cl2FNO3/c1-22(2)15(11-19(23)24)20(22)21(27)29-18(12-26)13-8-9-16(25)17(10-13)28-14-6-4-3-5-7-14/h3-11,15,18,20H,1-2H3
47 atoms
Cl -5.251813 1.34981 0.345428
Cl -5.695688 4.12635 -0.303404
F  4.266784 -2.84965 -1.867386
O  1.146436 2.067165 0.370278
O  -0.252102 0.344967 0.652974
O  3.183118 -3.393109 0.486722
N  3.936519 3.15335 1.761268
C  -1.461631 1.61649 -1.986999
C  -2.362129 1.833876 -0.805425
C  -0.898745 2.209237 -0.707819
C  -1.535164 2.550278 -3.169573
C  -1.139756 0.1956 -2.378204
C  -3.358563 2.911104 -0.776528
C  -0.016189 1.423403 0.16833
C  -4.594904 2.801061 -0.308078
C  2.136906 1.37016 1.121296
C  2.755314 0.246707 0.326648
C  3.135588 2.382163 1.46758
C  2.67968 -1.048941 0.813993
C  3.357487 0.504377 -0.899472
C  3.188875 -2.099366 0.067076
C  3.881556 -0.539959 -1.643161
C  3.781173 -1.827629 -1.157265
C  2.054582 -3.930688 1.057996
C  2.261617 -4.9399 1.98739
C  0.770126 -3.540089 0.701679
C  1.168278 -5.565567 2.567407
C  -0.313289 -4.169676 1.299501
C  -0.122992 -5.180641 2.231627
H  -2.633938 0.927363 -0.276654
H  -0.659382 3.265231 -0.762918
H  -0.617718 2.484052 -3.75622
H  -2.365709 2.272013 -3.820576
H  -1.666379 3.592871 -2.883939
H  -0.135046 0.130018 -2.799357
H  -1.209007 -0.509092 -1.552513
H  -1.840603 -0.135348 -3.146061
H  -3.067175 3.88217 -1.158876
H  1.723703 0.990136 2.06102
H  2.215805 -1.241138 1.773753
H  3.42408 1.514619 -1.283697
H  4.354523 -0.359473 -2.599434
H  3.270316 -5.23414 2.249316
H  0.600599 -2.759659 -0.029607
H  1.331203 -6.353265 3.291248
H  -1.315017 -3.864845 1.025893
H  -0.973877 -5.665365 2.691074
elementType: Cl F O N C H
totalener: -2149.92518242 hartree
nucrepener: 2921.11291823 hartree
electener: -5071.03810065 hartree
oneelecener: -8755.15631943 hartree
twoeener: 3684.11821879 hartree
cpcmener: -0.03793422 hartree
kineticenergy: 2143.45204256 hartree
xcener: -159.159271286895 hartree
chargesum: 0.0000000
charge: -0.057397 -0.061414 -0.209226 -0.276114 -0.464658 -0.335852 -0.100376 0.092419 0.033321 -0.076572 -0.265518 -0.262861 -0.206031 0.399919 0.039875 0.413919 -0.000371 -0.219092 -0.180720 -0.205844 0.216004 -0.165980 0.206667 0.297765 -0.253626 -0.191948 -0.121688 -0.156407 -0.186982 0.080052 0.102931 0.098569 0.102003 0.093094 0.100587 0.089347 0.101495 0.134322 0.141308 0.156593 0.151631 0.155430 0.148208 0.160439 0.161426 0.161330 0.160020
qa: -0.0574 -0.0614 -0.2092 -0.2761 -0.4647 -0.3359 -0.1004 0.0924 0.0333 -0.0766 -0.2655 -0.2629 -0.2060 0.3999 0.0399 0.4139 -0.0004 -0.2191 -0.1807 -0.2058 0.2160 -0.1660 0.2067 0.2978 -0.2536 -0.1919 -0.1217 -0.1564 -0.1870 0.0801 0.1029 0.0986 0.1020 0.0931 0.1006 0.0893 0.1015 0.1343 0.1413 0.1566 0.1516 0.1554 0.1482 0.1604 0.1614 0.1613 0.1600
va: 1.2680 1.2435 1.0832 2.1364 2.0428 2.0765 3.1102 3.7362 3.8733 3.8449 3.9054 3.9093 3.8967 4.1828 4.2089 3.7255 3.6050 4.0783 3.9305 3.9375 3.6894 3.8832 4.0775 3.6808 3.9965 3.8885 3.8796 3.8991 3.9026 1.0476 1.0313 1.0012 1.0008 1.0050 0.9994 1.0146 1.0015 1.0164 1.0157 1.0036 1.0072 0.9961 1.0074 0.9930 0.9877 0.9901 0.9896
dispcorr: -0.024655055 hartree
energy: -2149.949837473411
dipole: 11.28295 -12.07084 -0.78788 -11.56874 11.62876 0.06002 -8.70081 7.49319 -1.20762
magnitude: 1.44316 au
magnitude: 3.66822 debye
