program: Orca
programVersion: 5.0.2
elementType: Cl Cl F O O O N C C C C C C C C C C C C C C C C C C C C C C H H H H H H H H H H H H H H H H H H
charge: 0
multiplicity: 1
keywords: wb97x-d3
keywords: def2-TZVPP
keywords: def2/J RIJCOSX
keywords: DEFGRID2
keywords: scfconv7
keywords: smallprint printgap noloewdin
keywords: NOSOSCF
formula: C22H18Cl2FNO3
InChI: InChI=1/C22H18Cl2FNO3/c1-22(2)15(11-19(23)24)20(22)21(27)29-18(12-26)13-8-9-16(25)17(10-13)28-14-6-4-3-5-7-14/h3-11,15,18,20H,1-2H3
47 atoms
Cl -2.524209 4.03011 -1.373537
Cl -5.378899 3.761947 -1.020737
F  4.800125 -2.440765 2.080431
O  0.618473 0.878405 -1.282013
O  0.717527 2.156321 0.551168
O  2.338922 -3.073134 1.482995
N  2.576653 0.152199 -3.834488
C  -1.945921 0.466658 1.078307
C  -2.258584 1.903032 0.833417
C  -1.364834 1.179896 -0.139616
C  -2.982586 -0.581806 0.762665
C  -1.067643 0.113548 2.250777
C  -3.60418 2.336196 0.39667
C  0.068539 1.48877 -0.213523
C  -3.808953 3.248693 -0.541316
C  2.026994 0.944904 -1.40495
C  2.752822 0.043865 -0.427666
C  2.311999 0.504359 -2.772188
C  2.135673 -1.103611 0.06176
C  4.054934 0.355024 -0.075117
C  2.831838 -1.943726 0.915806
C  4.759232 -0.489126 0.77262
C  4.143236 -1.619307 1.254317
C  1.096478 -3.545558 1.111871
C  0.090534 -3.540285 2.063561
C  0.88698 -4.066427 -0.156975
C  -1.152109 -4.066926 1.736513
C  -0.362787 -4.578608 -0.474606
C  -1.383676 -4.57962 0.467756
H  -1.75048 2.605876 1.488895
H  -1.808194 0.884225 -1.083399
H  -2.502054 -1.543041 0.57227
H  -3.664067 -0.714339 1.603842
H  -3.577554 -0.331374 -0.115246
H  -0.488932 -0.78897 2.048272
H  -0.376338 0.907641 2.525306
H  -1.692673 -0.087444 3.122358
H  -4.470465 1.90294 0.883396
H  2.391317 1.973445 -1.308395
H  1.118184 -1.342722 -0.219043
H  4.527481 1.250307 -0.45733
H  5.7782 -0.26614 1.060327
H  0.278816 -3.136356 3.050127
H  1.686524 -4.073166 -0.887452
H  -1.940815 -4.069671 2.477323
H  -0.535632 -4.983006 -1.46318
H  -2.354873 -4.983492 0.215018
elementType: Cl F O N C H
totalener: -2149.92236811 hartree
nucrepener: 3030.09450792 hartree
electener: -5180.01687603 hartree
oneelecener: -8973.14466595 hartree
twoeener: 3793.12778992 hartree
cpcmener: -0.03778159 hartree
kineticenergy: 2143.46924499 hartree
xcener: -159.163687907384 hartree
chargesum: -0.0000000
charge: -0.051891 -0.056721 -0.213093 -0.287655 -0.453775 -0.331666 -0.099550 0.170067 -0.029186 -0.153799 -0.289366 -0.270172 -0.218658 0.399648 0.071230 0.410738 -0.021816 -0.226363 -0.207119 -0.210861 0.260849 -0.144241 0.190334 0.288492 -0.241868 -0.193016 -0.159811 -0.137889 -0.151703 0.113639 0.117117 0.088192 0.106551 0.101375 0.077848 0.101562 0.107670 0.142301 0.149613 0.146007 0.149690 0.153640 0.157409 0.158011 0.161494 0.163714 0.163027
qa: -0.0519 -0.0567 -0.2131 -0.2877 -0.4538 -0.3317 -0.0995 0.1701 -0.0292 -0.1538 -0.2894 -0.2702 -0.2187 0.3996 0.0712 0.4107 -0.0218 -0.2264 -0.2071 -0.2109 0.2608 -0.1442 0.1903 0.2885 -0.2419 -0.1930 -0.1598 -0.1379 -0.1517 0.1136 0.1171 0.0882 0.1066 0.1014 0.0778 0.1016 0.1077 0.1423 0.1496 0.1460 0.1497 0.1536 0.1574 0.1580 0.1615 0.1637 0.1630
va: 1.2774 1.2496 1.0750 2.1046 2.0516 2.0768 3.1128 3.6675 3.8974 3.8253 3.9221 3.8783 3.9093 4.1598 4.1886 3.7015 3.7385 4.0790 3.9072 3.9658 3.6647 3.8716 4.0439 3.6388 3.9504 3.9419 3.8362 3.8744 3.8453 1.0210 1.0251 1.0078 0.9992 1.0005 1.0076 1.0192 1.0030 1.0073 1.0163 1.0175 0.9998 0.9966 1.0005 0.9969 0.9898 0.9876 0.9879
dispcorr: -0.028344963 hartree
energy: -2149.950713075489
dipole: -2.05888 0.46154 -1.59734 -24.07395 23.49656 -0.57738 13.44223 -12.11939 1.32284
magnitude: 2.15285 au
magnitude: 5.47210 debye
