program: Orca
programVersion: 5.0.2
elementType: Cl Cl F O O O N C C C C C C C C C C C C C C C C C C C C C C H H H H H H H H H H H H H H H H H H
charge: 0
multiplicity: 1
keywords: wb97x-d3
keywords: def2-TZVPP
keywords: def2/J RIJCOSX
keywords: DEFGRID2
keywords: scfconv7
keywords: smallprint printgap noloewdin
keywords: NOSOSCF
formula: C22H18Cl2FNO3
InChI: InChI=1/C22H18Cl2FNO3/c1-22(2)15(11-19(23)24)20(22)21(27)29-18(12-26)13-8-9-16(25)17(10-13)28-14-6-4-3-5-7-14/h3-11,15,18,20H,1-2H3
47 atoms
Cl -1.757302 0.064497 -1.501843
Cl -4.419856 -0.766923 -0.751066
F  4.545563 -3.22471 0.96589
O  1.040185 1.749304 0.331431
O  0.448387 3.652503 -0.670846
O  2.041425 -3.157053 0.118239
N  2.066549 1.838789 -2.939658
C  -2.116797 3.514904 1.148955
C  -2.390536 2.696977 -0.062997
C  -1.111773 2.460481 0.72463
C  -2.860619 3.192166 2.422396
C  -1.824294 4.985159 0.983301
C  -3.411278 1.626787 -0.087966
C  0.16897 2.734194 0.060096
C  -3.220133 0.461717 -0.6900
C  2.292572 1.725544 -0.33348
C  2.933303 0.403613 0.008569
C  2.126462 1.816576 -1.790808
C  2.175566 -0.754185 -0.132911
C  4.240017 0.339143 0.459992
C  2.712826 -1.979307 0.212531
C  4.798602 -0.894715 0.772863
C  4.031167 -2.030839 0.655498
C  0.667929 -3.154737 0.253724
C  0.046892 -2.526749 1.325744
C  -0.067275 -3.847171 -0.693776
C  -1.334379 -2.588917 1.43358
C  -1.447951 -3.917859 -0.561223
C  -2.085782 -3.28579 0.496082
H  -2.244463 3.20699 -1.01211
H  -1.106246 1.565049 1.335084
H  -2.301793 3.548751 3.288742
H  -3.834472 3.684395 2.429511
H  -3.025066 2.122321 2.553507
H  -1.121834 5.33176 1.742815
H  -1.420412 5.235874 0.005508
H  -2.749132 5.550708 1.108471
H  -4.36798 1.803909 0.390167
H  2.92755 2.557959 -0.015392
H  1.158816 -0.701913 -0.502008
H  4.82827 1.239832 0.573732
H  5.818688 -0.968081 1.125829
H  0.627081 -1.995323 2.069808
H  0.434314 -4.329893 -1.522693
H  -1.822384 -2.09889 2.265735
H  -2.024453 -4.462204 -1.29742
H  -3.161395 -3.33659 0.591774
elementType: Cl F O N C H
totalener: -2149.92129198 hartree
nucrepener: 3121.93107291 hartree
electener: -5271.85236489 hartree
oneelecener: -9157.69156179 hartree
twoeener: 3885.83919690 hartree
cpcmener: -0.04101474 hartree
kineticenergy: 2143.47403957 hartree
xcener: -159.164847026458 hartree
chargesum: 0.0000000
charge: -0.055763 -0.057078 -0.210445 -0.272884 -0.464313 -0.335496 -0.099058 0.148792 -0.032341 -0.142392 -0.281772 -0.278056 -0.210158 0.410719 0.089994 0.436526 -0.008907 -0.236870 -0.168266 -0.189546 0.199850 -0.147995 0.182140 0.278872 -0.188078 -0.236484 -0.138302 -0.126326 -0.194101 0.120440 0.111504 0.100220 0.103129 0.094337 0.102857 0.093730 0.096063 0.144573 0.138028 0.126146 0.152362 0.153871 0.159653 0.149268 0.162011 0.160429 0.159116
qa: -0.0558 -0.0571 -0.2104 -0.2729 -0.4643 -0.3355 -0.0991 0.1488 -0.0323 -0.1424 -0.2818 -0.2781 -0.2102 0.4107 0.0900 0.4365 -0.0089 -0.2369 -0.1683 -0.1895 0.1999 -0.1480 0.1821 0.2789 -0.1881 -0.2365 -0.1383 -0.1263 -0.1941 0.1204 0.1115 0.1002 0.1031 0.0943 0.1029 0.0937 0.0961 0.1446 0.1380 0.1261 0.1524 0.1539 0.1597 0.1493 0.1620 0.1604 0.1591
va: 1.2839 1.2499 1.0809 2.1489 2.0329 2.0709 3.1097 3.7133 3.8798 3.8644 3.9165 3.8855 3.9154 4.1345 4.1449 3.7426 3.7320 4.0418 3.9306 3.9099 3.7354 3.8734 4.0631 3.6620 3.9170 4.0108 3.8340 3.8746 3.8640 1.0180 1.0204 1.0025 0.9992 0.9997 0.9988 1.0183 1.0010 1.0064 1.0114 1.0301 1.0001 0.9967 0.9941 1.0051 0.9901 0.9890 0.9967
dispcorr: -0.028939319 hartree
energy: -2149.950231296073
dipole: -8.14493 7.05224 -1.09269 20.65481 -19.77898 0.87583 16.66270 -13.72521 2.93749
magnitude: 3.25422 au
magnitude: 8.27156 debye
