program: Orca
programVersion: 5.0.2
elementType: Cl Cl F O O O N C C C C C C C C C C C C C C C C C C C C C C H H H H H H H H H H H H H H H H H H
charge: 0
multiplicity: 1
keywords: wb97x-d3
keywords: def2-TZVPP
keywords: def2/J RIJCOSX
keywords: DEFGRID2
keywords: scfconv7
keywords: smallprint printgap noloewdin
keywords: NOSOSCF
formula: C22H18Cl2FNO3
InChI: InChI=1/C22H18Cl2FNO3/c1-22(2)15(11-19(23)24)20(22)21(27)29-18(12-26)13-8-9-16(25)17(10-13)28-14-6-4-3-5-7-14/h3-11,15,18,20H,1-2H3
47 atoms
Cl -3.174661 -0.303107 -2.557172
Cl -4.901359 -0.896542 -0.324487
F  3.919264 -3.080991 -0.989973
O  1.277458 2.161575 1.20538
O  1.047468 2.199772 -1.015452
O  2.241216 -2.888356 1.06585
N  3.782088 4.027457 -0.131334
C  -1.80978 3.302248 -0.249576
C  -1.91076 1.85713 -0.639188
C  -0.889635 2.285422 0.39999
C  -2.843922 3.917792 0.661776
C  -1.286148 4.268701 -1.283318
C  -3.020825 1.00411 -0.200007
C  0.541489 2.20898 0.078594
C  -3.613095 0.071857 -0.93564
C  2.678549 1.981653 1.068206
C  3.038887 0.641446 0.466218
C  3.281154 3.117603 0.362297
C  2.459246 -0.486252 1.036431
C  3.928327 0.50541 -0.589043
C  2.749072 -1.74278 0.534108
C  4.244061 -0.754248 -1.07729
C  3.64319 -1.861109 -0.521295
C  0.887458 -3.003079 1.270594
C  0.491041 -3.842812 2.301523
C  -0.05057 -2.364941 0.469625
C  -0.861358 -4.045408 2.532614
C  -1.399883 -2.572802 0.720235
C  -1.813412 -3.408501 1.747819
H  -1.495505 1.626101 -1.613916
H  -1.129888 2.05123 1.430628
H  -3.163543 3.251319 1.461596
H  -2.438867 4.816473 1.129743
H  -3.727529 4.210178 0.0917
H  -0.64529 3.801397 -2.027205
H  -2.128771 4.715087 -1.814099
H  -0.72842 5.07912 -0.811137
H  -3.388368 1.131381 0.811262
H  3.054796 2.028123 2.093671
H  1.777979 -0.395871 1.873931
H  4.390829 1.36974 -1.04617
H  4.93848 -0.870766 -1.898516
H  1.235328 -4.335089 2.914444
H  0.250467 -1.717701 -0.344095
H  -1.168341 -4.70094 3.336716
H  -2.131536 -2.079877 0.095022
H  -2.867613 -3.563606 1.933542
elementType: Cl F O N C H
totalener: -2149.92441208 hartree
nucrepener: 3053.19436260 hartree
electener: -5203.11877467 hartree
oneelecener: -9019.50815077 hartree
twoeener: 3816.38937609 hartree
cpcmener: -0.03950440 hartree
kineticenergy: 2143.45389892 hartree
xcener: -159.163413906179 hartree
chargesum: 0.0000000
charge: -0.061847 -0.066441 -0.210560 -0.289699 -0.462758 -0.337907 -0.089906 0.083874 0.048122 -0.077735 -0.265491 -0.267326 -0.226077 0.425013 0.060104 0.519006 -0.060215 -0.253091 -0.215223 -0.154347 0.186902 -0.166388 0.208020 0.304465 -0.259958 -0.210260 -0.105574 -0.120841 -0.223366 0.083172 0.098881 0.092493 0.100046 0.101876 0.093829 0.099669 0.102660 0.133695 0.148575 0.153439 0.136595 0.154619 0.148745 0.150682 0.160834 0.175811 0.153885
qa: -0.0618 -0.0664 -0.2106 -0.2897 -0.4628 -0.3379 -0.0899 0.0839 0.0481 -0.0777 -0.2655 -0.2673 -0.2261 0.4250 0.0601 0.5190 -0.0602 -0.2531 -0.2152 -0.1543 0.1869 -0.1664 0.2080 0.3045 -0.2600 -0.2103 -0.1056 -0.1208 -0.2234 0.0832 0.0989 0.0925 0.1000 0.1019 0.0938 0.0997 0.1027 0.1337 0.1486 0.1534 0.1366 0.1546 0.1487 0.1507 0.1608 0.1758 0.1539
va: 1.2612 1.2377 1.0814 2.1310 2.0420 2.0719 3.1028 3.7655 3.8424 3.8664 3.9093 3.9053 3.9211 4.1184 4.1888 3.7891 3.7513 4.0942 3.9673 3.8755 3.7160 3.9102 4.0735 3.6774 4.0022 3.9214 3.8826 3.8275 3.9474 1.0463 1.0340 1.0060 1.0005 1.0005 1.0177 1.0000 0.9996 1.0180 0.9889 1.0096 1.0147 0.9971 1.0073 1.0080 0.9877 0.9745 0.9963
dispcorr: -0.027039641 hartree
energy: -2149.951451716805
dipole: -1.67838 0.31504 -1.36334 19.65120 -19.24704 0.40416 11.85995 -9.66622 2.19373
magnitude: 2.61429 au
magnitude: 6.64499 debye
