program: Orca
programVersion: 5.0.2
elementType: Cl Cl F O O O N C C C C C C C C C C C C C C C C C C C C C C H H H H H H H H H H H H H H H H H H
charge: 0
multiplicity: 1
keywords: wb97x-d3
keywords: def2-TZVPP
keywords: def2/J RIJCOSX
keywords: DEFGRID2
keywords: scfconv7
keywords: smallprint printgap noloewdin
keywords: NOSOSCF
formula: C22H18Cl2FNO3
InChI: InChI=1/C22H18Cl2FNO3/c1-22(2)15(11-19(23)24)20(22)21(27)29-18(12-26)13-8-9-16(25)17(10-13)28-14-6-4-3-5-7-14/h3-11,15,18,20H,1-2H3
47 atoms
Cl -2.82646 5.875124 -0.419607
Cl -5.373891 4.82851 -1.272775
F  4.380937 -1.964515 2.595873
O  0.082785 0.248459 -1.361191
O  0.774308 2.167532 -0.446535
O  2.169221 -3.265727 1.895953
N  1.243405 -1.844116 -3.629152
C  -1.910598 1.817465 1.169702
C  -2.079606 2.863372 0.10645
C  -1.523544 1.502599 -0.263826
C  -3.113552 1.077646 1.701344
C  -0.853143 2.05299 2.219519
C  -3.400713 3.238759 -0.410504
C  -0.115294 1.386009 -0.672275
C  -3.801989 4.478029 -0.661862
C  1.423415 -0.042809 -1.744093
C  2.236268 -0.564815 -0.586683
C  1.306357 -1.051626 -2.798233
C  1.806578 -1.698504 0.093913
C  3.385218 0.100677 -0.187481
C  2.53973 -2.178303 1.164743
C  4.116685 -0.36755 0.894068
C  3.68863 -1.498987 1.553057
C  1.739753 -4.399081 1.242023
C  0.722953 -5.121774 1.847239
C  2.321367 -4.836524 0.059243
C  0.284568 -6.300099 1.259992
C  1.864042 -6.011272 -0.521173
C  0.84613 -6.746201 0.071703
H  -1.344227 3.659088 0.141549
H  -2.199419 0.82889 -0.777791
H  -2.798768 0.148455 2.178291
H  -3.626128 1.678991 2.453872
H  -3.834988 0.819503 0.927626
H  -0.42195 1.108268 2.555252
H  -0.044093 2.695557 1.880839
H  -1.308628 2.534114 3.086456
H  -4.111912 2.44573 -0.608934
H  1.910422 0.831931 -2.185835
H  0.903304 -2.215838 -0.209731
H  3.715606 0.985179 -0.715449
H  5.015189 0.139223 1.220127
H  0.281785 -4.767231 2.769778
H  3.122315 -4.278664 -0.409047
H  -0.508372 -6.864759 1.732153
H  2.314222 -6.353425 -1.443571
H  0.496229 -7.660866 -0.387558
elementType: Cl F O N C H
totalener: -2149.92537841 hartree
nucrepener: 2882.79093729 hartree
electener: -5032.71631570 hartree
oneelecener: -8678.73977793 hartree
twoeener: 3646.02346223 hartree
cpcmener: -0.03782105 hartree
kineticenergy: 2143.45460713 hartree
xcener: -159.158779480370 hartree
chargesum: 0.0000000
charge: -0.057284 -0.061338 -0.209206 -0.285910 -0.464315 -0.339450 -0.101383 0.089346 0.032808 -0.079927 -0.264527 -0.267822 -0.201484 0.404292 0.038658 0.439624 -0.005358 -0.226082 -0.172415 -0.168940 0.166392 -0.163708 0.203213 0.273665 -0.245293 -0.176023 -0.125786 -0.152697 -0.185855 0.081869 0.100760 0.099607 0.101326 0.093086 0.101279 0.093871 0.099846 0.134751 0.142258 0.154563 0.153100 0.155373 0.149774 0.158364 0.162137 0.163003 0.161836
qa: -0.0573 -0.0613 -0.2092 -0.2859 -0.4643 -0.3395 -0.1014 0.0893 0.0328 -0.0799 -0.2645 -0.2678 -0.2015 0.4043 0.0387 0.4396 -0.0054 -0.2261 -0.1724 -0.1689 0.1664 -0.1637 0.2032 0.2737 -0.2453 -0.1760 -0.1258 -0.1527 -0.1859 0.0819 0.1008 0.0996 0.1013 0.0931 0.1013 0.0939 0.0998 0.1348 0.1423 0.1546 0.1531 0.1554 0.1498 0.1584 0.1621 0.1630 0.1618
va: 1.2684 1.2439 1.0836 2.1335 2.0466 2.0661 3.1085 3.7324 3.8731 3.8560 3.9072 3.9049 3.8959 4.1741 4.2087 3.7094 3.6167 4.0837 3.9379 3.9118 3.7368 3.8835 4.0724 3.6905 4.0007 3.8845 3.8828 3.8916 3.8984 1.0462 1.0327 1.0013 1.0007 1.0052 0.9990 1.0176 1.0005 1.0162 1.0153 1.0110 1.0024 0.9962 1.0063 0.9967 0.9878 0.9892 0.9891
dispcorr: -0.023815833 hartree
energy: -2149.949194243141
dipole: 4.90064 -5.39393 -0.49329 -26.58205 26.29687 -0.28519 10.72706 -9.93881 0.78826
magnitude: 0.97263 au
magnitude: 2.47224 debye
