program: Orca
programVersion: 5.0.2
elementType: Cl Cl F O O O N C C C C C C C C C C C C C C C C C C C C C C H H H H H H H H H H H H H H H H H H
charge: 0
multiplicity: 1
keywords: wb97x-d3
keywords: def2-TZVPP
keywords: def2/J RIJCOSX
keywords: DEFGRID2
keywords: scfconv7
keywords: smallprint printgap noloewdin
keywords: NOSOSCF
formula: C22H18Cl2FNO3
InChI: InChI=1/C22H18Cl2FNO3/c1-22(2)15(11-19(23)24)20(22)21(27)29-18(12-26)13-8-9-16(25)17(10-13)28-14-6-4-3-5-7-14/h3-11,15,18,20H,1-2H3
47 atoms
Cl -2.955793 5.76715 0.833662
Cl -4.82727 5.703512 -1.360523
F  2.701759 -3.205553 2.63647
O  0.599348 1.022573 -1.477037
O  0.562968 2.148922 0.453398
O  0.888804 -3.626328 0.62864
N  2.879034 -0.08317 -3.58583
C  -2.490738 1.319123 0.212818
C  -2.31232 2.794114 -0.00468
C  -1.462431 1.816084 -0.788631
C  -3.683654 0.600104 -0.368932
C  -2.054453 0.752282 1.541255
C  -3.303265 3.595052 -0.732037
C  -0.022618 1.71483 -0.506438
C  -3.643381 4.845692 -0.448101
C  1.97687 0.73388 -1.272489
C  2.189279 -0.33211 -0.225603
C  2.465485 0.280243 -2.576242
C  1.477269 -1.524726 -0.303954
C  3.086258 -0.120453 0.809528
C  1.649727 -2.494555 0.665026
C  3.276538 -1.096998 1.777188
C  2.549892 -2.263779 1.701237
C  1.509307 -4.853016 0.569217
C  2.771903 -5.031266 0.021922
C  0.784602 -5.931309 1.056666
C  3.313139 -6.309579 -0.018746
C  1.336409 -7.201723 1.001779
C  2.60432 -7.397558 0.469912
H  -1.793465 3.305514 0.79816
H  -1.731796 1.661071 -1.827093
H  -3.482771 -0.471135 -0.419614
H  -4.560631 0.742686 0.265107
H  -3.936688 0.93121 -1.374923
H  -1.688781 -0.269681 1.424402
H  -1.27807 1.33873 2.02817
H  -2.910234 0.720866 2.218166
H  -3.8041 3.136096 -1.575979
H  2.539097 1.637051 -1.013058
H  0.777172 -1.709275 -1.110359
H  3.639648 0.807184 0.870734
H  3.969304 -0.944835 2.594402
H  3.33541 -4.19712 -0.376812
H  -0.200355 -5.775432 1.477523
H  4.298981 -6.4497 -0.442126
H  0.772001 -8.041141 1.385596
H  3.034483 -8.389176 0.435249
elementType: Cl F O N C H
totalener: -2149.92566640 hartree
nucrepener: 2871.22357661 hartree
electener: -5021.14924301 hartree
oneelecener: -8655.69783831 hartree
twoeener: 3634.54859530 hartree
cpcmener: -0.03843981 hartree
kineticenergy: 2143.44412469 hartree
xcener: -159.156265142060 hartree
chargesum: -0.0000000
charge: -0.057589 -0.061805 -0.208844 -0.283271 -0.458574 -0.334833 -0.100661 0.094122 0.030261 -0.068717 -0.269831 -0.267577 -0.202502 0.388067 0.040930 0.431774 -0.010135 -0.223781 -0.201920 -0.157475 0.143737 -0.159787 0.267027 0.268586 -0.169358 -0.244804 -0.163895 -0.128682 -0.184379 0.077639 0.102799 0.099254 0.102353 0.094608 0.099900 0.094302 0.102152 0.132573 0.145204 0.142597 0.153247 0.155529 0.157688 0.148957 0.162530 0.161234 0.161348
qa: -0.0576 -0.0618 -0.2088 -0.2833 -0.4586 -0.3348 -0.1007 0.0941 0.0303 -0.0687 -0.2698 -0.2676 -0.2025 0.3881 0.0409 0.4318 -0.0101 -0.2238 -0.2019 -0.1575 0.1437 -0.1598 0.2670 0.2686 -0.1694 -0.2448 -0.1639 -0.1287 -0.1844 0.0776 0.1028 0.0993 0.1024 0.0946 0.0999 0.0943 0.1022 0.1326 0.1452 0.1426 0.1532 0.1555 0.1577 0.1490 0.1625 0.1612 0.1613
va: 1.2680 1.2428 1.0814 2.1286 2.0515 2.0508 3.1094 3.7410 3.8845 3.8263 3.9067 3.9051 3.8979 4.2027 4.2071 3.6963 3.6099 4.0853 4.0032 3.9337 3.7726 3.9079 3.9728 3.6783 3.8637 3.9908 3.9027 3.8935 3.8908 1.0484 1.0310 1.0010 1.0003 1.0052 0.9990 1.0163 1.0007 1.0181 1.0139 1.0235 0.9994 0.9966 0.9999 1.0076 0.9896 0.9880 0.9890
dispcorr: -0.024001430 hartree
energy: -2149.949667833955
dipole: 5.46704 -5.85375 -0.38671 -33.09217 32.39156 -0.70061 2.91961 -2.27565 0.64397
magnitude: 1.02718 au
magnitude: 2.61087 debye
