program: Orca
programVersion: 5.0.2
elementType: Cl Cl F O O O N C C C C C C C C C C C C C C C C C C C C C C H H H H H H H H H H H H H H H H H H
charge: 0
multiplicity: 1
keywords: wb97x-d3
keywords: def2-TZVPP
keywords: def2/J RIJCOSX
keywords: DEFGRID2
keywords: scfconv7
keywords: smallprint printgap noloewdin
keywords: NOSOSCF
formula: C22H18Cl2FNO3
InChI: InChI=1/C22H18Cl2FNO3/c1-22(2)15(11-19(23)24)20(22)21(27)29-18(12-26)13-8-9-16(25)17(10-13)28-14-6-4-3-5-7-14/h3-11,15,18,20H,1-2H3
47 atoms
Cl -3.110822 5.658575 -0.457198
Cl -5.487097 4.431515 -1.535772
F  4.436062 -2.311969 2.613047
O  0.28276 0.39751 -1.226826
O  0.739746 2.213957 -0.006184
O  2.287645 -3.491294 1.628438
N  1.80995 -1.188637 -3.689351
C  -2.081642 1.633573 1.227291
C  -2.21835 2.702256 0.184154
C  -1.51198 1.400333 -0.160209
C  -3.273992 0.783251 1.594271
C  -1.174938 1.907449 2.401488
C  -3.501147 2.987889 -0.469831
C  -0.065092 1.419698 -0.424375
C  -3.959626 4.195196 -0.775896
C  1.668452 0.253734 -1.514163
C  2.414495 -0.428034 -0.394362
C  1.728063 -0.553459 -2.734091
C  1.972997 -1.664004 0.06888
C  3.52584 0.178775 0.167125
C  2.661958 -2.301724 1.085251
C  4.215704 -0.452988 1.193155
C  3.781297 -1.682174 1.633238
C  1.771578 -4.479451 0.820558
C  2.320558 -4.775034 -0.420109
C  0.709822 -5.213524 1.326112
C  1.783915 -5.818056 -1.161041
C  0.191806 -6.261512 0.578013
C  0.720388 -6.563591 -0.669182
H  -1.558405 3.551607 0.32027
H  -2.070768 0.6998 -0.769582
H  -3.871065 0.486869 0.733222
H  -2.941701 -0.129741 2.090207
H  -3.923863 1.319097 2.288082
H  -0.399302 2.639212 2.189522
H  -1.76987 2.293737 3.230949
H  -0.694523 0.988087 2.741274
H  -4.133991 2.147606 -0.729245
H  2.130926 1.219164 -1.742782
H  1.096904 -2.132819 -0.364104
H  3.863147 1.141974 -0.191605
H  5.08704 0.005544 1.641346
H  3.157611 -4.208156 -0.808025
H  0.297365 -4.970903 2.296983
H  2.207959 -6.050113 -2.128991
H  -0.635151 -6.836292 0.973478
H  0.309464 -7.375915 -1.253312
elementType: Cl F O N C H
totalener: -2149.92548155 hartree
nucrepener: 2878.03701465 hartree
electener: -5027.96249620 hartree
oneelecener: -8669.21619506 hartree
twoeener: 3641.25369886 hartree
cpcmener: -0.03758850 hartree
kineticenergy: 2143.43951002 hartree
xcener: -159.156446028205 hartree
chargesum: -0.0000000
charge: -0.057188 -0.060647 -0.209679 -0.290069 -0.466463 -0.337028 -0.101681 0.093099 0.031512 -0.081597 -0.268426 -0.270710 -0.200463 0.408279 0.039142 0.433452 -0.004550 -0.224439 -0.180273 -0.173908 0.185063 -0.158820 0.196148 0.279543 -0.186073 -0.247816 -0.148132 -0.124144 -0.186221 0.082941 0.100069 0.094036 0.100013 0.101884 0.094660 0.099413 0.102591 0.133400 0.144499 0.152696 0.152279 0.154645 0.160361 0.150374 0.163570 0.162274 0.162383
qa: -0.0572 -0.0606 -0.2097 -0.2901 -0.4665 -0.3370 -0.1017 0.0931 0.0315 -0.0816 -0.2684 -0.2707 -0.2005 0.4083 0.0391 0.4335 -0.0046 -0.2244 -0.1803 -0.1739 0.1851 -0.1588 0.1961 0.2795 -0.1861 -0.2478 -0.1481 -0.1241 -0.1862 0.0829 0.1001 0.0940 0.1000 0.1019 0.0947 0.0994 0.1026 0.1334 0.1445 0.1527 0.1523 0.1546 0.1604 0.1504 0.1636 0.1623 0.1624
va: 1.2684 1.2444 1.0821 2.1303 2.0428 2.0699 3.1085 3.7199 3.8802 3.8611 3.9102 3.9030 3.8970 4.1641 4.2095 3.7047 3.6338 4.0857 3.9345 3.9166 3.7322 3.8798 4.0623 3.6871 3.9026 4.0068 3.8876 3.8797 3.9010 1.0447 1.0325 1.0051 1.0008 1.0005 1.0181 1.0000 0.9987 1.0171 1.0162 1.0126 1.0013 0.9964 0.9955 1.0060 0.9889 0.9878 0.9891
dispcorr: -0.023520193 hartree
energy: -2149.949001745226
dipole: 4.05734 -4.76675 -0.70940 -25.52912 25.12334 -0.40578 10.50726 -9.62214 0.88512
magnitude: 1.20472 au
magnitude: 3.06215 debye
