program: Orca
programVersion: 5.0.2
elementType: Cl Cl F O O O N C C C C C C C C C C C C C C C C C C C C C C H H H H H H H H H H H H H H H H H H
charge: 0
multiplicity: 1
keywords: wb97x-d3
keywords: def2-TZVPP
keywords: def2/J RIJCOSX
keywords: DEFGRID2
keywords: scfconv7
keywords: smallprint printgap noloewdin
keywords: NOSOSCF
formula: C22H18Cl2FNO3
InChI: InChI=1/C22H18Cl2FNO3/c1-22(2)15(11-19(23)24)20(22)21(27)29-18(12-26)13-8-9-16(25)17(10-13)28-14-6-4-3-5-7-14/h3-11,15,18,20H,1-2H3
47 atoms
Cl -3.13058 5.553031 -1.67509
Cl -5.682454 4.218461 -1.529421
F  4.707955 -1.966721 2.467143
O  0.025108 0.306673 -0.987142
O  0.777914 2.375529 -0.580789
O  2.473628 -3.313526 1.961777
N  0.822631 -1.920517 -3.297363
C  -1.672197 2.530854 1.353931
C  -2.082253 3.122482 0.039171
C  -1.440119 1.743559 0.079232
C  -2.712097 1.961715 2.288704
C  -0.527599 3.18654 2.085983
C  -3.486603 3.214733 -0.374532
C  -0.105275 1.558095 -0.50905
C  -4.016428 4.197368 -1.091974
C  1.29266 -0.055545 -1.527881
C  2.222543 -0.564629 -0.456984
C  1.012309 -1.098989 -2.515208
C  1.895448 -1.725196 0.236029
C  3.377819 0.136049 -0.145551
C  2.738739 -2.200709 1.223595
C  4.221761 -0.32955 0.852922
C  3.898441 -1.492339 1.516615
C  1.989708 -4.435098 1.325231
C  1.008797 -5.159442 1.984361
C  2.490508 -4.857127 0.100772
C  0.522998 -6.324539 1.407528
C  1.987204 -6.018325 -0.467769
C  1.003626 -6.7552 0.178802
H  -1.431657 3.912303 -0.318841
H  -2.112717 0.906586 -0.064792
H  -3.199153 2.760979 2.849502
H  -3.483625 1.388751 1.776435
H  -2.236265 1.294324 3.00867
H  0.154462 3.723727 1.432305
H  -0.928005 3.906948 2.801196
H  0.04737 2.449966 2.649282
H  -4.153708 2.413552 -0.079456
H  1.752107 0.781161 -2.062151
H  0.986854 -2.269058 0.002818
H  3.630263 1.041851 -0.680347
H  5.1299 0.201747 1.105185
H  0.631467 -4.816269 2.939027
H  3.264111 -4.29592 -0.408082
H  -0.24258 -6.890965 1.921022
H  2.373876 -6.348836 -1.422655
H  0.617053 -7.659419 -0.271598
elementType: Cl F O N C H
totalener: -2149.92541753 hartree
nucrepener: 2861.91417256 hartree
electener: -5011.83959009 hartree
oneelecener: -8637.00574259 hartree
twoeener: 3625.16615250 hartree
cpcmener: -0.03705392 hartree
kineticenergy: 2143.45050469 hartree
xcener: -159.157991069192 hartree
chargesum: 0.0000000
charge: -0.056955 -0.060894 -0.209025 -0.288846 -0.470111 -0.338923 -0.101994 0.093219 0.028134 -0.083886 -0.269351 -0.272727 -0.196791 0.419648 0.039229 0.435780 -0.007108 -0.227365 -0.156927 -0.161709 0.156351 -0.167110 0.206004 0.263134 -0.238749 -0.170835 -0.128832 -0.152673 -0.181942 0.082716 0.099641 0.101607 0.094570 0.099647 0.094669 0.098899 0.102434 0.132326 0.139839 0.152756 0.152237 0.154465 0.149936 0.159190 0.162009 0.162764 0.161550
qa: -0.0570 -0.0609 -0.2090 -0.2888 -0.4701 -0.3389 -0.1020 0.0932 0.0281 -0.0839 -0.2694 -0.2727 -0.1968 0.4196 0.0392 0.4358 -0.0071 -0.2274 -0.1569 -0.1617 0.1564 -0.1671 0.2060 0.2631 -0.2387 -0.1708 -0.1288 -0.1527 -0.1819 0.0827 0.0996 0.1016 0.0946 0.0996 0.0947 0.0989 0.1024 0.1323 0.1398 0.1528 0.1522 0.1545 0.1499 0.1592 0.1620 0.1628 0.1615
va: 1.2688 1.2441 1.0836 2.1326 2.0384 2.0651 3.1065 3.7221 3.8832 3.8588 3.9107 3.9026 3.8993 4.1543 4.2102 3.7060 3.6383 4.0845 3.9413 3.9025 3.7494 3.8892 4.0674 3.6972 3.9993 3.8845 3.8829 3.8900 3.8949 1.0445 1.0330 1.0005 1.0053 1.0006 1.0184 0.9998 0.9988 1.0181 1.0179 1.0092 1.0040 0.9966 1.0057 0.9959 0.9878 0.9892 0.9891
dispcorr: -0.023325061 hartree
energy: -2149.948742592136
dipole: 8.10644 -8.36467 -0.25822 -19.32713 19.38265 0.05552 16.24928 -14.97315 1.27612
magnitude: 1.30317 au
magnitude: 3.31239 debye
