program: Orca
programVersion: 5.0.2
elementType: Cl Cl F O O O N C C C C C C C C C C C C C C C C C C C C C C H H H H H H H H H H H H H H H H H H
charge: 0
multiplicity: 1
keywords: wb97x-d3
keywords: def2-TZVPP
keywords: def2/J RIJCOSX
keywords: DEFGRID2
keywords: scfconv7
keywords: smallprint printgap noloewdin
keywords: NOSOSCF
formula: C22H18Cl2FNO3
InChI: InChI=1/C22H18Cl2FNO3/c1-22(2)15(11-19(23)24)20(22)21(27)29-18(12-26)13-8-9-16(25)17(10-13)28-14-6-4-3-5-7-14/h3-11,15,18,20H,1-2H3
47 atoms
Cl -5.594559 2.484422 -1.130111
Cl -5.434503 5.308993 -0.568364
F  4.311531 -2.708478 -1.926177
O  0.507372 1.523676 0.83542
O  -1.048137 0.181107 -0.043505
O  2.718283 -3.942741 -0.222222
N  2.684564 1.370114 3.30805
C  -1.239883 2.640978 -2.040173
C  -2.442367 2.597365 -1.140798
C  -1.054503 2.532645 -0.537809
C  -0.810542 3.946035 -2.664147
C  -0.985626 1.449557 -2.929027
C  -3.249939 3.796775 -0.885527
C  -0.580158 1.284543 0.080956
C  -4.575434 3.84581 -0.864637
C  1.116195 0.40123 1.454699
C  1.945169 -0.424461 0.498166
C  1.984666 0.962988 2.491228
C  1.900747 -1.807877 0.594565
C  2.77419 0.19363 -0.428976
C  2.713151 -2.584035 -0.218764
C  3.566346 -0.579052 -1.26347
C  3.537047 -1.951791 -1.14137
C  2.532315 -4.647207 0.944731
C  1.78976 -5.814474 0.851658
C  3.106558 -4.258998 2.147889
C  1.619094 -6.603059 1.980299
C  2.914814 -5.051206 3.270952
C  2.173267 -6.222711 3.194694
H  -2.981172 1.656783 -1.153952
H  -0.692988 3.435576 -0.059182
H  -0.900771 4.794075 -1.987089
H  0.233602 3.885473 -2.974483
H  -1.408545 4.158289 -3.55198
H  0.084866 1.304787 -3.084923
H  -1.401523 0.523344 -2.539545
H  -1.440209 1.624752 -3.905325
H  -2.726533 4.727173 -0.699941
H  0.37419 -0.228544 1.956212
H  1.236705 -2.277696 1.310023
H  2.816174 1.271921 -0.50811
H  4.218025 -0.117494 -1.993544
H  1.355103 -6.104627 -0.096341
H  3.700029 -3.35636 2.219141
H  1.042388 -7.51557 1.906768
H  3.357982 -4.74916 4.21068
H  2.031584 -6.835831 4.074421
elementType: Cl F O N C H
totalener: -2149.92487653 hartree
nucrepener: 2845.16823825 hartree
electener: -4995.09311477 hartree
oneelecener: -8603.35005621 hartree
twoeener: 3608.25694143 hartree
cpcmener: -0.03899460 hartree
kineticenergy: 2143.44393445 hartree
xcener: -159.157798846707 hartree
chargesum: -0.0000000
charge: -0.057298 -0.061029 -0.210633 -0.282172 -0.460091 -0.332722 -0.101204 0.093881 0.034602 -0.081207 -0.263777 -0.266291 -0.201580 0.394660 0.035867 0.416314 -0.004183 -0.219792 -0.176879 -0.204890 0.214026 -0.166477 0.205840 0.296838 -0.256857 -0.200665 -0.119054 -0.143500 -0.189441 0.081199 0.100818 0.092933 0.099183 0.101712 0.099145 0.094519 0.101148 0.134606 0.143807 0.153934 0.152134 0.154980 0.149524 0.161579 0.161697 0.163188 0.161606
qa: -0.0573 -0.0610 -0.2106 -0.2822 -0.4601 -0.3327 -0.1012 0.0939 0.0346 -0.0812 -0.2638 -0.2663 -0.2016 0.3947 0.0359 0.4163 -0.0042 -0.2198 -0.1769 -0.2049 0.2140 -0.1665 0.2058 0.2968 -0.2569 -0.2007 -0.1191 -0.1435 -0.1894 0.0812 0.1008 0.0929 0.0992 0.1017 0.0991 0.0945 0.1011 0.1346 0.1438 0.1539 0.1521 0.1550 0.1495 0.1616 0.1617 0.1632 0.1616
va: 1.2684 1.2441 1.0805 2.1245 2.0494 2.0748 3.1097 3.7339 3.8803 3.8440 3.9061 3.9045 3.8873 4.1917 4.2086 3.7060 3.6487 4.0850 3.9625 3.9189 3.7034 3.8907 4.0590 3.6736 4.0082 3.9133 3.8753 3.8822 3.9043 1.0458 1.0328 1.0051 1.0014 1.0008 1.0002 1.0167 1.0006 1.0162 1.0197 1.0020 1.0100 0.9965 1.0068 0.9949 0.9878 0.9889 0.9893
dispcorr: -0.023514216 hartree
energy: -2149.948390744593
dipole: 19.28609 -19.24041 0.04569 -11.81131 12.29922 0.48791 -2.13047 1.39550 -0.73498
magnitude: 0.88337 au
magnitude: 2.24534 debye
