program: Orca
programVersion: 5.0.2
elementType: Cl Cl F O O O N C C C C C C C C C C C C C C C C C C C C C C H H H H H H H H H H H H H H H H H H
charge: 0
multiplicity: 1
keywords: wb97x-d3
keywords: def2-TZVPP
keywords: def2/J RIJCOSX
keywords: DEFGRID2
keywords: scfconv7
keywords: smallprint printgap noloewdin
keywords: NOSOSCF
formula: C22H18Cl2FNO3
InChI: InChI=1/C22H18Cl2FNO3/c1-22(2)15(11-19(23)24)20(22)21(27)29-18(12-26)13-8-9-16(25)17(10-13)28-14-6-4-3-5-7-14/h3-11,15,18,20H,1-2H3
47 atoms
Cl -5.583459 2.392732 -1.057248
Cl -5.460352 5.230954 -0.557741
F  4.277959 -2.725537 -1.959838
O  0.577045 1.579524 0.817704
O  -0.987665 0.198451 0.020545
O  2.667966 -3.914036 -0.23755
N  2.828863 1.496236 3.230434
C  -1.260331 2.585162 -2.047664
C  -2.435607 2.552505 -1.112914
C  -1.030645 2.53093 -0.548381
C  -0.877172 3.875716 -2.729177
C  -1.007501 1.369054 -2.903073
C  -3.256879 3.746213 -0.875162
C  -0.52652 1.30917 0.098543
C  -4.58268 3.775282 -0.837537
C  1.207821 0.475802 1.45124
C  2.007277 -0.374971 0.492253
C  2.103351 1.066934 2.447868
C  1.924413 -1.756249 0.58998
C  2.839608 0.218837 -0.448239
C  2.703527 -2.555728 -0.233727
C  3.599224 -0.57609 -1.291568
C  3.533541 -1.947617 -1.166812
C  2.471194 -4.612611 0.931231
C  1.685876 -5.752256 0.847942
C  3.074232 -4.245212 2.126727
C  1.50193 -6.534565 1.978912
C  2.869102 -5.030264 3.252327
C  2.08565 -6.17479 3.185767
H  -2.958402 1.603405 -1.078139
H  -0.670017 3.454112 -0.109322
H  0.15745 3.825132 -3.071752
H  -1.508269 4.044096 -3.603465
H  -0.96384 4.744874 -2.078875
H  0.061514 1.236605 -3.079542
H  -1.397999 0.449441 -2.473513
H  -1.487702 1.504464 -3.873545
H  -2.745023 4.688191 -0.718103
H  0.481802 -0.141066 1.990904
H  1.256732 -2.207053 1.314193
H  2.909045 1.295655 -0.529786
H  4.253178 -0.134317 -2.031849
H  1.228434 -6.026216 -0.094127
H  3.699981 -3.363972 2.189546
H  0.892286 -7.426047 1.913347
H  3.334993 -4.744337 4.186142
H  1.934165 -6.783056 4.067229
elementType: Cl F O N C H
totalener: -2149.92501576 hartree
nucrepener: 2848.85774753 hartree
electener: -4998.78276329 hartree
oneelecener: -8610.75487329 hartree
twoeener: 3611.97211000 hartree
cpcmener: -0.03887631 hartree
kineticenergy: 2143.44289625 hartree
xcener: -159.157569796585 hartree
chargesum: -0.0000000
charge: -0.057137 -0.061304 -0.210553 -0.281924 -0.460949 -0.332919 -0.101413 0.093970 0.035344 -0.081875 -0.263308 -0.266203 -0.203596 0.395614 0.036484 0.416876 -0.006089 -0.218590 -0.173645 -0.207437 0.212942 -0.165372 0.205226 0.296732 -0.256926 -0.200268 -0.119423 -0.143837 -0.189067 0.081301 0.101139 0.099113 0.101884 0.092640 0.099331 0.094544 0.100637 0.135136 0.143271 0.154346 0.152101 0.155017 0.149830 0.161603 0.161644 0.163469 0.161641
qa: -0.0571 -0.0613 -0.2106 -0.2819 -0.4609 -0.3329 -0.1014 0.0940 0.0353 -0.0819 -0.2633 -0.2662 -0.2036 0.3956 0.0365 0.4169 -0.0061 -0.2186 -0.1736 -0.2074 0.2129 -0.1654 0.2052 0.2967 -0.2569 -0.2003 -0.1194 -0.1438 -0.1891 0.0813 0.1011 0.0991 0.1019 0.0926 0.0993 0.0945 0.1006 0.1351 0.1433 0.1543 0.1521 0.1550 0.1498 0.1616 0.1616 0.1635 0.1616
va: 1.2686 1.2438 1.0806 2.1268 2.0489 2.0747 3.1097 3.7328 3.8759 3.8491 3.9057 3.9045 3.8871 4.1898 4.2075 3.7062 3.6448 4.0850 3.9563 3.9225 3.7051 3.8895 4.0597 3.6737 4.0080 3.9138 3.8756 3.8823 3.9043 1.0462 1.0325 1.0014 1.0008 1.0051 1.0002 1.0166 1.0007 1.0157 1.0195 1.0022 1.0098 0.9964 1.0067 0.9948 0.9879 0.9888 0.9893
dispcorr: -0.023533468 hartree
energy: -2149.948549225688
dipole: 18.93067 -18.92403 0.00664 -11.72363 12.18408 0.46045 -2.38021 1.64520 -0.73501
magnitude: 0.86735 au
magnitude: 2.20463 debye
