program: Orca
programVersion: 5.0.2
elementType: Cl Cl F O O O N C C C C C C C C C C C C C C C C C C C C C C H H H H H H H H H H H H H H H H H H
charge: 0
multiplicity: 1
keywords: wb97x-d3
keywords: def2-TZVPP
keywords: def2/J RIJCOSX
keywords: DEFGRID2
keywords: scfconv7
keywords: smallprint printgap noloewdin
keywords: NOSOSCF
formula: C22H18Cl2FNO3
InChI: InChI=1/C22H18Cl2FNO3/c1-22(2)15(11-19(23)24)20(22)21(27)29-18(12-26)13-8-9-16(25)17(10-13)28-14-6-4-3-5-7-14/h3-11,15,18,20H,1-2H3
47 atoms
Cl -3.288412 -0.128845 2.427735
Cl -4.793135 -0.979468 0.120444
F  3.909198 -3.159386 0.952088
O  1.455712 2.14432 -1.295427
O  1.113063 2.137512 0.912938
O  2.225327 -2.873096 -1.142962
N  3.950088 3.960707 0.18059
C  -1.720711 3.211533 0.027126
C  -1.79584 1.76482 0.417438
C  -0.75486 2.216398 -0.586535
C  -1.249654 4.197948 1.067489
C  -2.757811 3.785684 -0.908688
C  -2.87888 0.881245 -0.033712
C  0.668272 2.162328 -0.198076
C  -3.565489 0.051549 0.741591
C  2.844997 1.957138 -1.082338
C  3.160283 0.601057 -0.488949
C  3.436137 3.073951 -0.337262
C  2.560088 -0.50656 -1.073294
C  4.025703 0.426835 0.580148
C  2.802917 -1.77889 -0.58537
C  4.296355 -0.846567 1.056953
C  3.677822 -1.937275 0.481295
C  0.864116 -2.997131 -1.065459
C  0.255384 -3.772798 -2.042032
C  0.110634 -2.411259 -0.056588
C  -1.116847 -3.961246 -2.00599
C  -1.262099 -2.610328 -0.035448
C  -1.884072 -3.378167 -1.007186
H  -1.398225 1.54616 1.402035
H  -0.943175 1.97497 -1.626798
H  -2.10746 4.569393 1.630019
H  -0.548376 3.768032 1.777763
H  -0.76661 5.055893 0.596681
H  -2.380642 4.695868 -1.376603
H  -3.040327 3.102865 -1.709241
H  -3.664556 4.044359 -0.359833
H  -3.143764 0.887321 -1.083769
H  3.267924 2.009579 -2.089701
H  1.880921 -0.396849 -1.910584
H  4.490047 1.278765 1.058041
H  4.967303 -0.99263 1.89259
H  0.859236 -4.225413 -2.817628
H  0.576987 -1.811342 0.714218
H  -1.587964 -4.566592 -2.769191
H  -1.843161 -2.165835 0.760743
H  -2.955478 -3.521575 -0.98176
totalener: -2149.91080286 hartree
nucrepener: 3075.77786599 hartree
electener: -5225.68866886 hartree
oneelecener: -9064.69743554 hartree
twoeener: 3839.00876669 hartree
kineticenergy: 2143.53413975 hartree
xcener: -159.171937201654 hartree
chargesum: 0.0000000
charge: -0.042877 -0.045471 -0.182566 -0.281705 -0.352041 -0.298277 0.006233 0.059983 0.047158 -0.070911 -0.241939 -0.239248 -0.183463 0.334472 0.029229 0.430731 -0.063278 -0.287630 -0.199836 -0.093123 0.124821 -0.155666 0.222787 0.245457 -0.204677 -0.146077 -0.094414 -0.142430 -0.143370 0.090606 0.077301 0.090332 0.103740 0.091014 0.096461 0.071229 0.100585 0.098457 0.123080 0.130659 0.122304 0.128757 0.126405 0.128224 0.125223 0.142226 0.121523
qa: -0.0429 -0.0455 -0.1826 -0.2817 -0.3520 -0.2983 0.0062 0.0600 0.0472 -0.0709 -0.2419 -0.2392 -0.1835 0.3345 0.0292 0.4307 -0.0633 -0.2876 -0.1998 -0.0931 0.1248 -0.1557 0.2228 0.2455 -0.2047 -0.1461 -0.0944 -0.1424 -0.1434 0.0906 0.0773 0.0903 0.1037 0.0910 0.0965 0.0712 0.1006 0.0985 0.1231 0.1307 0.1223 0.1288 0.1264 0.1282 0.1252 0.1422 0.1215
va: 1.2823 1.2579 1.1212 2.1068 2.1426 2.1150 3.1108 3.8046 3.8081 3.8620 3.9151 3.9066 3.8921 4.2178 4.2492 3.9039 3.7717 4.0531 3.9884 3.9150 3.8135 3.9328 4.1024 3.7785 4.0260 3.8861 3.9748 3.9325 3.9681 1.0474 1.0369 1.0006 1.0209 1.0028 1.0044 1.0098 1.0028 1.0302 0.9873 1.0188 1.0234 1.0073 1.0132 1.0149 0.9987 0.9995 1.0107
dispcorr: -0.027882864 hartree
energy: -2149.938685726537
dipole: -1.36579 0.39193 -0.97386 18.90125 -18.72728 0.17397 -10.60380 9.41247 -1.19133
magnitude: 1.54852 au
magnitude: 3.93603 debye
