program: Orca
programVersion: 5.0.2
elementType: Cl Cl F O O O N C C C C C C C C C C C C C C C C C C C C C C H H H H H H H H H H H H H H H H H H
charge: 0
multiplicity: 1
keywords: wb97x-d3
keywords: def2-TZVPP
keywords: def2/J RIJCOSX
keywords: DEFGRID2
keywords: scfconv7
keywords: smallprint printgap noloewdin
keywords: NOSOSCF
formula: C22H18Cl2FNO3
InChI: InChI=1/C22H18Cl2FNO3/c1-22(2)15(11-19(23)24)20(22)21(27)29-18(12-26)13-8-9-16(25)17(10-13)28-14-6-4-3-5-7-14/h3-11,15,18,20H,1-2H3
47 atoms
Cl -2.339826 6.264327 0.654621
Cl -4.654791 5.619381 2.249295
F  2.716774 -2.998321 -3.210128
O  0.175172 0.537427 1.26959
O  0.647062 2.223451 -0.124646
O  1.000577 -3.951642 -1.325366
N  1.956586 -1.165126 3.477942
C  -2.424112 1.986167 -0.749515
C  -2.175339 3.157567 0.152893
C  -1.61961 1.795394 0.522197
C  -1.747226 1.981745 -2.099106
C  -3.781152 1.322776 -0.771248
C  -3.230193 3.744454 0.988885
C  -0.159883 1.583083 0.491165
C  -3.379336 5.036584 1.254819
C  1.545792 0.156415 1.262127
C  1.875674 -0.69418 0.062078
C  1.75944 -0.579086 2.510294
C  1.315119 -1.961478 -0.064128
C  2.709911 -0.207454 -0.931688
C  1.589148 -2.73847 -1.173148
C  3.000679 -0.984297 -2.043653
C  2.44154 -2.239263 -2.154151
C  1.732675 -5.082967 -1.085096
C  2.969774 -5.072779 -0.457775
C  1.150931 -6.280333 -1.48077
C  3.625597 -6.276114 -0.235643
C  1.816887 -7.470715 -1.24808
C  3.059181 -7.477246 -0.627915
H  -1.43061 3.855512 -0.212077
H  -2.130643 1.257378 1.312467
H  -2.403229 2.45096 -2.833758
H  -0.80333 2.520138 -2.106391
H  -1.554252 0.96062 -2.432857
H  -3.695695 0.307661 -1.160985
H  -4.242895 1.25093 0.212676
H  -4.465282 1.872436 -1.419412
H  -3.955387 3.077863 1.438725
H  2.191816 1.039949 1.278663
H  0.661582 -2.36272 0.701584
H  3.13079 0.785401 -0.8495
H  3.651566 -0.617668 -2.82559
H  3.425267 -4.148015 -0.129055
H  0.18414 -6.269955 -1.966415
H  4.589618 -6.265649 0.255362
H  1.360251 -8.401363 -1.557942
H  3.576682 -8.409794 -0.449783
totalener: -2149.91441747 hartree
nucrepener: 2846.36399512 hartree
electener: -4996.27841259 hartree
oneelecener: -8605.79623829 hartree
twoeener: 3609.51782571 hartree
kineticenergy: 2143.52912605 hartree
xcener: -159.166611399776 hartree
chargesum: -0.0000000
charge: -0.038150 -0.043046 -0.181688 -0.263580 -0.378707 -0.299115 0.002306 0.066305 0.040855 -0.088541 -0.245894 -0.248218 -0.201957 0.356638 0.051550 0.335044 -0.034938 -0.268146 -0.132204 -0.078251 0.071189 -0.168344 0.256744 0.274744 -0.138725 -0.207574 -0.141951 -0.093403 -0.141738 0.086523 0.082633 0.091729 0.100723 0.089704 0.095958 0.074666 0.100420 0.097032 0.122408 0.126194 0.121082 0.129991 0.122051 0.121985 0.126420 0.124090 0.125184
qa: -0.0382 -0.0430 -0.1817 -0.2636 -0.3787 -0.2991 0.0023 0.0663 0.0409 -0.0885 -0.2459 -0.2482 -0.2020 0.3566 0.0516 0.3350 -0.0349 -0.2681 -0.1322 -0.0783 0.0712 -0.1683 0.2567 0.2747 -0.1387 -0.2076 -0.1420 -0.0934 -0.1417 0.0865 0.0826 0.0917 0.1007 0.0897 0.0960 0.0747 0.1004 0.0970 0.1224 0.1262 0.1211 0.1300 0.1221 0.1220 0.1264 0.1241 0.1252
va: 1.2895 1.2619 1.1221 2.1353 2.1276 2.1085 3.1159 3.7662 3.8363 3.8644 3.9137 3.9104 3.9217 4.2350 4.2551 3.8183 3.6609 4.0226 4.0143 3.9225 3.8885 3.9431 4.0561 3.7750 3.9075 4.0293 3.9913 3.9546 3.9615 1.0497 1.0353 1.0019 1.0204 1.0018 1.0041 1.0102 1.0023 1.0319 1.0167 1.0238 1.0171 1.0068 1.0131 1.0149 1.0006 0.9988 1.0003
dispcorr: -0.023427195 hartree
energy: -2149.937844665401
dipole: 5.01547 -5.34438 -0.32890 -29.10857 28.99269 -0.11588 -12.25980 11.17470 -1.08510
magnitude: 1.13976 au
magnitude: 2.89703 debye
