program: Orca
programVersion: 5.0.2
elementType: Cl Cl F O O O N C C C C C C C C C C C C C C C C C C C C C C H H H H H H H H H H H H H H H H H H
charge: 0
multiplicity: 1
keywords: wb97x-d3
keywords: def2-TZVPP
keywords: def2/J RIJCOSX
keywords: DEFGRID2
keywords: scfconv7
keywords: smallprint printgap noloewdin
keywords: NOSOSCF
formula: C22H18Cl2FNO3
InChI: InChI=1/C22H18Cl2FNO3/c1-22(2)15(11-19(23)24)20(22)21(27)29-18(12-26)13-8-9-16(25)17(10-13)28-14-6-4-3-5-7-14/h3-11,15,18,20H,1-2H3
47 atoms
Cl -5.486948 2.68811 1.064189
Cl -5.280705 5.367735 0.016715
F  4.860091 -2.552137 1.492397
O  0.256945 1.167688 -0.748439
O  -1.121435 0.155591 0.696735
O  3.047577 -4.081893 0.28788
N  1.423015 0.292298 -3.724711
C  -1.120177 2.982754 2.081118
C  -2.351362 2.81975 1.243748
C  -0.986237 2.548101 0.635008
C  -0.899477 2.000903 3.206029
C  -0.6075 4.367405 2.400206
C  -3.133475 3.957913 0.746869
C  -0.657253 1.163455 0.244387
C  -4.455624 3.990898 0.630945
C  0.646804 -0.093355 -1.258226
C  1.767076 -0.72912 -0.466594
C  1.079106 0.146796 -2.638513
C  1.854342 -2.113046 -0.439559
C  2.724629 0.041854 0.174765
C  2.908927 -2.739405 0.20805
C  3.764097 -0.57775 0.85171
C  3.854469 -1.953706 0.857885
C  2.69986 -4.856227 -0.787766
C  1.989926 -6.018067 -0.531642
C  3.077546 -4.524409 -2.082421
C  1.654633 -6.856392 -1.584249
C  2.72645 -5.366782 -3.125459
C  2.014329 -6.532527 -2.883504
H  -2.922723 1.923871 1.458158
H  -0.59833 3.303904 -0.038444
H  -1.357485 2.386595 4.117863
H  -1.326888 1.02162 3.007723
H  0.16613 1.869316 3.401421
H  -1.165326 4.797604 3.233176
H  0.442741 4.32204 2.691289
H  -0.678662 5.059561 1.561967
H  -2.601823 4.847583 0.432938
H  -0.208058 -0.777581 -1.288336
H  1.100627 -2.716479 -0.93146
H  2.673224 1.121579 0.152044
H  4.519496 0.004636 1.36173
H  1.710373 -6.260903 0.484935
H  3.641211 -3.621373 -2.279363
H  1.10198 -7.764702 -1.384588
H  3.018374 -5.10843 -4.134578
H  1.745822 -7.185676 -3.702489
totalener: -2149.91278492 hartree
nucrepener: 2833.94329302 hartree
electener: -4983.85607794 hartree
oneelecener: -8580.93197229 hartree
twoeener: 3597.07589435 hartree
kineticenergy: 2143.52691962 hartree
xcener: -159.167572003392 hartree
chargesum: -0.0000000
charge: -0.037276 -0.042463 -0.183363 -0.277778 -0.364108 -0.288836 0.000721 0.069710 0.036920 -0.092944 -0.240185 -0.245994 -0.201922 0.333984 0.051898 0.298172 0.064431 -0.246643 -0.155483 -0.167955 0.144112 -0.153206 0.204900 0.225258 -0.200741 -0.153741 -0.093321 -0.114760 -0.139956 0.088306 0.083971 0.090710 0.103640 0.085304 0.101306 0.092913 0.074836 0.097494 0.125515 0.119920 0.127087 0.125900 0.128797 0.137135 0.127832 0.131753 0.128148
qa: -0.0373 -0.0425 -0.1834 -0.2778 -0.3641 -0.2888 0.0007 0.0697 0.0369 -0.0929 -0.2402 -0.2460 -0.2019 0.3340 0.0519 0.2982 0.0644 -0.2466 -0.1555 -0.1680 0.1441 -0.1532 0.2049 0.2253 -0.2007 -0.1537 -0.0933 -0.1148 -0.1400 0.0883 0.0840 0.0907 0.1036 0.0853 0.1013 0.0929 0.0748 0.0975 0.1255 0.1199 0.1271 0.1259 0.1288 0.1371 0.1278 0.1318 0.1281
va: 1.2902 1.2627 1.1201 2.1096 2.1396 2.1187 3.1216 3.7556 3.8437 3.8540 3.9124 3.9112 3.9251 4.2403 4.2567 3.8374 3.7085 4.0001 3.9739 3.9596 3.7967 3.9229 4.0958 3.8091 4.0352 3.9409 3.9356 3.9523 3.9596 1.0504 1.0352 1.0016 1.0206 1.0031 1.0023 1.0046 1.0098 1.0312 1.0241 1.0123 1.0175 1.0075 1.0121 1.0019 0.9987 0.9992 0.9999
dispcorr: -0.023098063 hartree
energy: -2149.935882981798
dipole: 18.75138 -18.63783 0.11354 -10.29408 10.61639 0.32231 4.90483 -3.99620 0.90863
magnitude: 0.97076 au
magnitude: 2.46748 debye
