program: Orca
programVersion: 5.0.2
elementType: Cl Cl F O O O N C C C C C C C C C C C C C C C C C C C C C C H H H H H H H H H H H H H H H H H H
charge: 0
multiplicity: 1
keywords: wb97x-d3
keywords: def2-TZVPP
keywords: def2/J RIJCOSX
keywords: DEFGRID2
keywords: scfconv7
keywords: smallprint printgap noloewdin
keywords: NOSOSCF
formula: C22H18Cl2FNO3
InChI: InChI=1/C22H18Cl2FNO3/c1-22(2)15(11-19(23)24)20(22)21(27)29-18(12-26)13-8-9-16(25)17(10-13)28-14-6-4-3-5-7-14/h3-11,15,18,20H,1-2H3
47 atoms
Cl -2.819091 5.729821 -0.232086
Cl -4.768548 5.253425 1.83865
F  4.006469 -3.361064 -1.872401
O  0.558502 0.845824 1.275206
O  0.533869 1.984928 -0.649969
O  2.605238 -3.9405 0.395749
N  2.76883 0.579831 3.716614
C  -2.516692 1.251704 -0.655266
C  -2.328723 2.627201 -0.092002
C  -1.521964 1.465111 0.467468
C  -2.048974 0.999042 -2.067883
C  -3.751596 0.458782 -0.295301
C  -3.321344 3.280333 0.769186
C  -0.060424 1.475613 0.260264
C  -3.592544 4.580145 0.782481
C  1.980748 0.824689 1.236984
C  2.510832 -0.299938 0.385873
C  2.408955 0.684156 2.631069
C  2.278708 -1.621197 0.756588
C  3.214495 -0.021533 -0.77436
C  2.774235 -2.658046 -0.010199
C  3.721555 -1.055184 -1.54891
C  3.508206 -2.357793 -1.156101
C  1.934573 -4.8163 -0.414566
C  2.220202 -6.162578 -0.23735
C  0.985687 -4.410253 -1.341356
C  1.551278 -7.106351 -0.997504
C  0.328281 -5.368568 -2.099808
C  0.605173 -6.715947 -1.935346
H  -1.7550 3.295158 -0.724238
H  -1.829687 1.084635 1.434741
H  -2.866472 1.204327 -2.760657
H  -1.20475 1.619186 -2.35611
H  -1.760393 -0.045278 -2.198691
H  -4.597037 0.771745 -0.909805
H  -3.583603 -0.603683 -0.475558
H  -4.044354 0.565022 0.748519
H  -3.879112 2.667147 1.46585
H  2.367209 1.778486 0.863951
H  1.730196 -1.860778 1.659625
H  3.3724 1.00313 -1.082372
H  4.286795 -0.853534 -2.448608
H  2.965226 -6.457965 0.489461
H  0.748625 -3.362331 -1.474632
H  1.77884 -8.155118 -0.860505
H  -0.410083 -5.052094 -2.824601
H  0.089129 -7.455986 -2.531418
totalener: -2149.91387141 hartree
nucrepener: 2864.38697695 hartree
electener: -5014.30084837 hartree
oneelecener: -8641.73781542 hartree
twoeener: 3627.43696706 hartree
kineticenergy: 2143.53343006 hartree
xcener: -159.167187211804 hartree
chargesum: -0.0000000
charge: -0.038052 -0.041864 -0.183407 -0.264013 -0.381849 -0.295047 0.002336 0.067318 0.035374 -0.091884 -0.243814 -0.246865 -0.200331 0.359337 0.052814 0.331343 -0.026122 -0.261307 -0.161231 -0.080390 0.096341 -0.161960 0.252415 0.253452 -0.201701 -0.136628 -0.094214 -0.135093 -0.140224 0.087282 0.083836 0.090656 0.102875 0.084873 0.101061 0.093726 0.075565 0.097621 0.118696 0.126857 0.119696 0.129379 0.125139 0.124600 0.125211 0.123146 0.125048
qa: -0.0381 -0.0419 -0.1834 -0.2640 -0.3818 -0.2950 0.0023 0.0673 0.0354 -0.0919 -0.2438 -0.2469 -0.2003 0.3593 0.0528 0.3313 -0.0261 -0.2613 -0.1612 -0.0804 0.0963 -0.1620 0.2524 0.2535 -0.2017 -0.1366 -0.0942 -0.1351 -0.1402 0.0873 0.0838 0.0907 0.1029 0.0849 0.1011 0.0937 0.0756 0.0976 0.1187 0.1269 0.1197 0.1294 0.1251 0.1246 0.1252 0.1231 0.1250
va: 1.2894 1.2633 1.1171 2.1361 2.1232 2.1078 3.1163 3.7528 3.8369 3.8682 3.9134 3.9128 3.9246 4.2231 4.2558 3.8307 3.6678 4.0164 4.0295 3.9339 3.8784 3.9554 4.0294 3.7882 4.0340 3.9118 3.9535 3.9848 3.9616 1.0504 1.0351 1.0013 1.0211 1.0027 1.0019 1.0045 1.0101 1.0316 1.0180 1.0256 1.0165 1.0070 1.0140 1.0084 0.9987 1.0013 1.0002
dispcorr: -0.023247701 hartree
energy: -2149.937119114593
dipole: -2.34977 1.44226 -0.90751 -30.15600 29.56158 -0.59442 -13.49349 12.11206 -1.38143
magnitude: 1.75649 au
magnitude: 4.46464 debye
