program: Orca
programVersion: 5.0.2
elementType: Cl Cl F O O O N C C C C C C C C C C C C C C C C C C C C C C H H H H H H H H H H H H H H H H H H
charge: 0
multiplicity: 1
keywords: wb97x-d3
keywords: def2-TZVPP
keywords: def2/J RIJCOSX
keywords: DEFGRID2
keywords: scfconv7
keywords: smallprint printgap noloewdin
keywords: NOSOSCF
formula: C22H18Cl2FNO3
InChI: InChI=1/C22H18Cl2FNO3/c1-22(2)15(11-19(23)24)20(22)21(27)29-18(12-26)13-8-9-16(25)17(10-13)28-14-6-4-3-5-7-14/h3-11,15,18,20H,1-2H3
47 atoms
Cl -1.885981 -0.749909 -0.554832
Cl -4.534309 -0.322401 -1.625875
F  3.487866 -3.25276 0.421275
O  1.275759 2.553139 -0.671993
O  0.758266 2.026356 1.437859
O  1.548614 -2.43679 -1.317534
N  3.712716 3.819721 1.344965
C  -1.910978 3.536921 0.78312
C  -2.131404 2.072329 0.626997
C  -0.959499 2.726406 -0.082285
C  -1.472131 4.066481 2.126612
C  -2.797244 4.497469 0.026447
C  -3.244785 1.522676 -0.175383
C  0.407093 2.392491 0.353446
C  -3.222221 0.311813 -0.717914
C  2.628241 2.225186 -0.422075
C  2.850552 0.754558 -0.135525
C  3.208649 3.104709 0.600874
C  2.08477 -0.18047 -0.823304
C  3.828557 0.321936 0.745768
C  2.292344 -1.533129 -0.629417
C  4.055561 -1.033974 0.931723
C  3.290745 -1.949222 0.243858
C  0.615459 -3.173446 -0.640964
C  0.215037 -2.893079 0.657894
C  0.042256 -4.225161 -1.344235
C  -0.762327 -3.682387 1.249387
C  -0.932881 -4.998545 -0.740367
C  -1.339821 -4.735275 0.561054
H  -1.836594 1.465571 1.479098
H  -1.068193 2.875568 -1.150162
H  -0.880883 3.353508 2.694703
H  -0.879739 4.975256 2.010533
H  -2.351951 4.319416 2.720471
H  -3.058348 4.139317 -0.969684
H  -3.725456 4.676472 0.57277
H  -2.296295 5.458728 -0.093719
H  -4.136315 2.120676 -0.32046
H  3.131906 2.478071 -1.360136
H  1.305555 0.120261 -1.512473
H  4.421109 1.032919 1.305767
H  4.81849 -1.379899 1.615776
H  0.638318 -2.065125 1.211672
H  0.364436 -4.427358 -2.357119
H  -1.073635 -3.459499 2.261237
H  -1.375643 -5.817133 -1.292152
H  -2.100781 -5.343857 1.029791
totalener: -2149.90932230 hartree
nucrepener: 3113.82109470 hartree
electener: -5263.73041701 hartree
oneelecener: -9141.34618737 hartree
twoeener: 3877.61577037 hartree
kineticenergy: 2143.54486967 hartree
xcener: -159.173989595948 hartree
chargesum: -0.0000000
charge: -0.022512 -0.041063 -0.185296 -0.283511 -0.354582 -0.293184 0.002333 0.105731 -0.058736 -0.080709 -0.241884 -0.275794 -0.210976 0.339585 0.073824 0.431361 -0.049162 -0.284296 -0.205099 -0.116665 0.126369 -0.149957 0.248313 0.295149 -0.236913 -0.207677 -0.105561 -0.083458 -0.149212 0.115552 0.089626 0.104213 0.092671 0.086510 0.081392 0.098544 0.097234 0.118871 0.122705 0.122596 0.123038 0.128677 0.134879 0.122368 0.126532 0.123908 0.124267
qa: -0.0225 -0.0411 -0.1853 -0.2835 -0.3546 -0.2932 0.0023 0.1057 -0.0587 -0.0807 -0.2419 -0.2758 -0.2110 0.3396 0.0738 0.4314 -0.0492 -0.2843 -0.2051 -0.1167 0.1264 -0.1500 0.2483 0.2951 -0.2369 -0.2077 -0.1056 -0.0835 -0.1492 0.1156 0.0896 0.1042 0.0927 0.0865 0.0814 0.0985 0.0972 0.1189 0.1227 0.1226 0.1230 0.1287 0.1349 0.1224 0.1265 0.1239 0.1243
va: 1.3272 1.2666 1.1174 2.1083 2.1387 2.1071 3.1099 3.7841 3.8882 3.8283 3.8966 3.9114 3.8753 4.1735 4.2198 3.9144 3.8001 4.0560 4.0236 3.9501 3.8462 3.9567 4.0520 3.6877 3.8698 4.0500 3.9509 3.9516 3.9790 1.0237 1.0314 1.0215 1.0028 1.0012 1.0022 0.9995 1.0065 1.0163 0.9843 1.0367 1.0232 1.0080 1.0169 1.0150 0.9988 0.9985 1.0002
dispcorr: -0.027956295 hartree
energy: -2149.937278595457
dipole: -4.59729 3.58587 -1.01143 18.37198 -18.09631 0.27568 10.29576 -10.90297 -0.60721
magnitude: 1.21148 au
magnitude: 3.07934 debye
