program: Orca
programVersion: 5.0.2
elementType: Cl Cl F O O O N C C C C C C C C C C C C C C C C C C C C C C H H H H H H H H H H H H H H H H H H
charge: 0
multiplicity: 1
keywords: wb97x-d3
keywords: def2-TZVPP
keywords: def2/J RIJCOSX
keywords: DEFGRID2
keywords: scfconv7
keywords: smallprint printgap noloewdin
keywords: NOSOSCF
formula: C22H18Cl2FNO3
InChI: InChI=1/C22H18Cl2FNO3/c1-22(2)15(11-19(23)24)20(22)21(27)29-18(12-26)13-8-9-16(25)17(10-13)28-14-6-4-3-5-7-14/h3-11,15,18,20H,1-2H3
47 atoms
Cl -3.176219 2.479548 2.376993
Cl -5.615589 3.680451 1.409567
F  4.771308 -1.855391 -2.406039
O  0.030255 0.691227 0.712244
O  0.855255 2.775138 0.730906
O  2.638723 -3.291998 -1.790542
N  0.39737 -1.580138 3.098882
C  -1.318296 3.288455 -1.460098
C  -1.839892 3.724926 -0.133007
C  -1.269702 2.33285 -0.277161
C  -0.063276 3.930135 -1.997902
C  -2.307078 2.90963 -2.537589
C  -3.287229 3.908505 0.112514
C  -0.015892 2.005942 0.426931
C  -3.937011 3.418423 1.159902
C  1.19707 0.208997 1.370733
C  2.174558 -0.363517 0.37697
C  0.738139 -0.794189 2.333839
C  1.930715 -1.600706 -0.210532
C  3.288307 0.374748 0.00886
C  2.810015 -2.114571 -1.149575
C  4.168036 -0.127079 -0.939749
C  3.927566 -1.360261 -1.50358
C  1.987746 -4.323745 -1.165203
C  2.311868 -4.717283 0.126341
C  1.023524 -5.003007 -1.892493
C  1.651034 -5.796814 0.690605
C  0.378936 -6.089179 -1.319506
C  0.684465 -6.486771 -0.026847
H  -1.197076 4.414202 0.409637
H  -1.985008 1.520096 -0.316911
H  0.618507 4.252587 -1.215612
H  0.475259 3.242427 -2.651804
H  -0.329464 4.806903 -2.590687
H  -2.61217 3.790699 -3.105603
H  -1.856365 2.206048 -3.238672
H  -3.207836 2.444847 -2.135648
H  -3.855119 4.505841 -0.591436
H  1.676429 1.015144 1.933774
H  1.057638 -2.176668 0.073127
H  3.471558 1.344361 0.452004
H  5.045289 0.431616 -1.236525
H  3.071072 -4.190459 0.690124
H  0.788795 -4.684367 -2.899667
H  1.89871 -6.10042 1.69906
H  -0.371556 -6.621614 -1.888482
H  0.174461 -7.329581 0.419257
totalener: -2149.91298677 hartree
nucrepener: 2913.11641920 hartree
electener: -5063.02940597 hartree
oneelecener: -8739.71682941 hartree
twoeener: 3676.68742345 hartree
kineticenergy: 2143.52303815 hartree
xcener: -159.166397567879 hartree
chargesum: -0.0000000
charge: -0.026126 -0.038836 -0.182726 -0.257080 -0.387706 -0.287176 -0.002460 0.112784 -0.012744 -0.172385 -0.251818 -0.266960 -0.249236 0.388578 0.093996 0.322085 -0.009607 -0.262643 -0.173175 -0.119547 0.157237 -0.150475 0.191061 0.236124 -0.160089 -0.203402 -0.102742 -0.092982 -0.138619 0.107964 0.108798 0.102361 0.090275 0.086891 0.093235 0.097878 0.088879 0.118830 0.121762 0.133154 0.126151 0.127372 0.133353 0.126863 0.129229 0.126679 0.126994
qa: -0.0261 -0.0388 -0.1827 -0.2571 -0.3877 -0.2872 -0.0025 0.1128 -0.0127 -0.1724 -0.2518 -0.2670 -0.2492 0.3886 0.0940 0.3221 -0.0096 -0.2626 -0.1732 -0.1195 0.1572 -0.1505 0.1911 0.2361 -0.1601 -0.2034 -0.1027 -0.0930 -0.1386 0.1080 0.1088 0.1024 0.0903 0.0869 0.0932 0.0979 0.0889 0.1188 0.1218 0.1332 0.1262 0.1274 0.1334 0.1269 0.1292 0.1267 0.1270
va: 1.3073 1.2665 1.1203 2.1260 2.1130 2.1205 3.1138 3.7238 3.8397 3.8950 3.9021 3.9161 3.9069 4.1603 4.2059 3.8287 3.7351 4.0307 3.9745 3.9128 3.7893 3.9208 4.0930 3.8061 3.9574 4.0412 3.9529 3.9347 3.9640 1.0254 1.0244 1.0204 1.0017 1.0029 1.0018 1.0059 1.0003 1.0177 1.0252 1.0144 1.0162 1.0071 1.0021 1.0124 0.9998 0.9989 1.0001
dispcorr: -0.024328498 hartree
energy: -2149.937315265810
dipole: 9.66762 -9.78526 -0.11764 -4.30459 4.98712 0.68253 -18.46033 17.24671 -1.21361
magnitude: 1.39733 au
magnitude: 3.55174 debye
