program: Orca
programVersion: 5.0.2
elementType: Cl Cl F O O O N C C C C C C C C C C C C C C C C C C C C C C H H H H H H H H H H H H H H H H H H
charge: 0
multiplicity: 1
keywords: wb97x-d3
keywords: def2-TZVPP
keywords: def2/J RIJCOSX
keywords: DEFGRID2
keywords: scfconv7
keywords: smallprint printgap noloewdin
keywords: NOSOSCF
formula: C22H18Cl2FNO3
InChI: InChI=1/C22H18Cl2FNO3/c1-22(2)15(11-19(23)24)20(22)21(27)29-18(12-26)13-8-9-16(25)17(10-13)28-14-6-4-3-5-7-14/h3-11,15,18,20H,1-2H3
47 atoms
Cl -0.58837 4.818076 1.848257
Cl -2.498255 6.950056 1.476494
F  -0.079414 -4.843509 -1.562925
O  -0.747221 0.681274 1.330288
O  0.213654 1.412077 -0.552391
O  1.921292 -3.068396 -2.093976
N  0.375505 -0.768225 4.079962
C  -2.707747 2.452612 -1.126854
C  -1.816986 3.56728 -0.692926
C  -1.889511 2.316061 0.148367
C  -2.344281 1.669309 -2.363909
C  -4.196481 2.588497 -0.915311
C  -2.352626 4.841542 -0.165716
C  -0.698615 1.450747 0.227104
C  -1.87684 5.453569 0.910469
C  0.351694 -0.198773 1.529512
C  0.232524 -1.453326 0.701328
C  0.351861 -0.507442 2.961674
C  1.147168 -1.701961 -0.312572
C  -0.797608 -2.354127 0.939396
C  1.046965 -2.849872 -1.079307
C  -0.912391 -3.501077 0.172113
C  0.008769 -3.738821 -0.828044
C  2.825755 -4.089967 -1.98409
C  3.490695 -4.444154 -3.150351
C  3.109794 -4.732838 -0.788075
C  4.440722 -5.44971 -3.11513
C  4.061211 -5.743252 -0.771811
C  4.729594 -6.108905 -1.928085
H  -0.893988 3.665477 -1.259641
H  -2.459889 2.379094 1.067682
H  -2.726538 0.64913 -2.303585
H  -2.796241 2.139021 -3.239104
H  -1.271961 1.615848 -2.533829
H  -4.657881 3.112685 -1.754413
H  -4.663122 1.605259 -0.844954
H  -4.442078 3.136665 -0.005353
H  -3.158267 5.327862 -0.703231
H  1.294824 0.307038 1.298571
H  1.943339 -1.000566 -0.526627
H  -1.511907 -2.172541 1.732214
H  -1.707044 -4.213414 0.347665
H  3.258475 -3.931091 -4.07402
H  2.610627 -4.45563 0.131075
H  4.955641 -5.723425 -4.026339
H  4.277644 -6.244466 0.162161
H  5.468792 -6.897658 -1.905882
totalener: -2149.91252187 hartree
nucrepener: 2888.99669843 hartree
electener: -5038.90922031 hartree
oneelecener: -8691.28199924 hartree
twoeener: 3652.37277894 hartree
kineticenergy: 2143.54391726 hartree
xcener: -159.168643600667 hartree
chargesum: 0.0000000
charge: -0.030392 -0.037625 -0.182778 -0.255605 -0.381087 -0.296886 0.000141 0.112367 -0.017133 -0.164989 -0.249490 -0.268236 -0.246449 0.383198 0.093069 0.317018 -0.027532 -0.257447 -0.081820 -0.137110 0.075752 -0.162671 0.258072 0.276140 -0.212175 -0.143428 -0.091904 -0.141193 -0.144259 0.110388 0.107409 0.090368 0.087457 0.103310 0.094583 0.096094 0.088522 0.119262 0.119331 0.117359 0.127381 0.129581 0.123660 0.122987 0.124693 0.126957 0.125111
qa: -0.0304 -0.0376 -0.1828 -0.2556 -0.3811 -0.2969 0.0001 0.1124 -0.0171 -0.1650 -0.2495 -0.2682 -0.2464 0.3832 0.0931 0.3170 -0.0275 -0.2574 -0.0818 -0.1371 0.0758 -0.1627 0.2581 0.2761 -0.2122 -0.1434 -0.0919 -0.1412 -0.1443 0.1104 0.1074 0.0904 0.0875 0.1033 0.0946 0.0961 0.0885 0.1193 0.1193 0.1174 0.1274 0.1296 0.1237 0.1230 0.1247 0.1270 0.1251
va: 1.3028 1.2684 1.1201 2.1316 2.1247 2.1108 3.1184 3.7307 3.8364 3.8867 3.9019 3.9144 3.9098 4.1595 4.2043 3.8381 3.6455 4.0232 3.9702 3.9774 3.8957 3.9384 4.0484 3.7752 4.0322 3.9086 3.9521 3.9914 3.9640 1.0257 1.0245 1.0018 1.0028 1.0190 1.0014 1.0064 1.0010 1.0171 1.0172 1.0288 1.0141 1.0071 1.0145 1.0134 0.9986 1.0006 1.0003
dispcorr: -0.024369058 hartree
energy: -2149.936890931386
dipole: -1.36443 0.53075 -0.83369 -21.89897 21.91353 0.01455 -19.26501 18.04680 -1.21821
magnitude: 1.47624 au
magnitude: 3.75230 debye
