program: Orca
programVersion: 5.0.2
elementType: Cl Cl F O O O N C C C C C C C C C C C C C C C C C C C C C C H H H H H H H H H H H H H H H H H H
charge: 0
multiplicity: 1
keywords: wb97x-d3
keywords: def2-TZVPP
keywords: def2/J RIJCOSX
keywords: DEFGRID2
keywords: scfconv7
keywords: smallprint printgap noloewdin
keywords: NOSOSCF
formula: C22H18Cl2FNO3
InChI: InChI=1/C22H18Cl2FNO3/c1-22(2)15(11-19(23)24)20(22)21(27)29-18(12-26)13-8-9-16(25)17(10-13)28-14-6-4-3-5-7-14/h3-11,15,18,20H,1-2H3
47 atoms
Cl -1.190951 4.954039 -0.165604
Cl -3.820419 6.117025 0.082284
F  2.173845 -4.619022 0.651704
O  0.490807 1.384988 1.104682
O  -0.002835 1.004678 -1.04214
O  2.728873 -3.153131 -1.598131
N  3.258125 1.961177 2.8028
C  -2.95148 0.982353 0.070621
C  -2.64348 2.276989 -0.601678
C  -1.704398 1.762009 0.461837
C  -2.849413 -0.295417 -0.726159
C  -4.036076 0.947653 1.120495
C  -3.431922 3.50393 -0.353746
C  -0.35088 1.339984 0.057138
C  -2.887618 4.699124 -0.16727
C  1.827717 0.96409 0.856523
C  1.942486 -0.539184 0.810898
C  2.619978 1.528483 1.951704
C  2.254375 -1.173154 -0.383805
C  1.691816 -1.29408 1.949121
C  2.344115 -2.553513 -0.443667
C  1.763235 -2.675866 1.897139
C  2.092375 -3.292559 0.707191
C  1.867318 -4.005103 -2.234978
C  0.4895 -3.932071 -2.092612
C  2.442213 -4.938909 -3.085412
C  -0.31097 -4.813691 -2.805519
C  1.629297 -5.806766 -3.794268
C  0.249226 -5.753619 -3.655568
H  -2.252317 2.188704 -1.612727
H  -1.753079 2.24574 1.430586
H  -3.809081 -0.507247 -1.200931
H  -2.095704 -0.248764 -1.50828
H  -2.611131 -1.139353 -0.076073
H  -4.086712 1.867645 1.703877
H  -5.01319 0.792793 0.658502
H  -3.867074 0.125034 1.816836
H  -4.513619 3.438958 -0.356161
H  2.197902 1.392397 -0.080555
H  2.431827 -0.601089 -1.285179
H  1.451453 -0.810163 2.887177
H  1.581366 -3.278154 2.77688
H  0.034222 -3.191677 -1.446902
H  3.518909 -4.97913 -3.183678
H  -1.385703 -4.757077 -2.69389
H  2.080959 -6.535318 -4.454563
H  -0.382066 -6.436962 -4.207003
totalener: -2149.91214322 hartree
nucrepener: 2935.33288150 hartree
electener: -5085.24502472 hartree
oneelecener: -8783.83449345 hartree
twoeener: 3698.58946873 hartree
kineticenergy: 2143.53466790 hartree
xcener: -159.166600010438 hartree
chargesum: 0.0000000
charge: -0.030124 -0.036770 -0.184002 -0.252767 -0.383055 -0.297880 0.000730 0.115686 -0.018231 -0.160261 -0.255883 -0.268100 -0.247885 0.381288 0.093734 0.316865 -0.027057 -0.258457 -0.095687 -0.142324 0.085791 -0.160274 0.263814 0.247967 -0.125920 -0.199885 -0.137363 -0.096128 -0.138755 0.111407 0.107270 0.090146 0.102203 0.087578 0.088935 0.094535 0.095932 0.119679 0.118675 0.118078 0.127650 0.129819 0.123808 0.123613 0.122497 0.124936 0.124172
qa: -0.0301 -0.0368 -0.1840 -0.2528 -0.3831 -0.2979 0.0007 0.1157 -0.0182 -0.1603 -0.2559 -0.2681 -0.2479 0.3813 0.0937 0.3169 -0.0271 -0.2585 -0.0957 -0.1423 0.0858 -0.1603 0.2638 0.2480 -0.1259 -0.1999 -0.1374 -0.0961 -0.1388 0.1114 0.1073 0.0901 0.1022 0.0876 0.0889 0.0945 0.0959 0.1197 0.1187 0.1181 0.1276 0.1298 0.1238 0.1236 0.1225 0.1249 0.1242
va: 1.3035 1.2699 1.1165 2.1348 2.1199 2.1057 3.1178 3.7271 3.8402 3.8917 3.9002 3.9141 3.9107 4.1555 4.2046 3.8436 3.6445 4.0213 3.9700 3.9823 3.8949 3.9395 4.0373 3.7970 3.9099 4.0290 3.9803 3.9565 3.9597 1.0252 1.0247 1.0037 1.0188 1.0012 1.0011 1.0013 1.0065 1.0168 1.0171 1.0285 1.0142 1.0068 1.0078 1.0145 1.0013 0.9987 1.0003
dispcorr: -0.024982433 hartree
energy: -2149.937125657135
dipole: -11.53162 9.80855 -1.72308 -30.43583 29.54315 -0.89267 -7.21090 6.75737 -0.45353
magnitude: 1.99287 au
magnitude: 5.06548 debye
