program: Orca
programVersion: 5.0.2
elementType: Cl Cl F O O O N C C C C C C C C C C C C C C C C C C C C C C H H H H H H H H H H H H H H H H H H
charge: 0
multiplicity: 1
keywords: wb97x-d3
keywords: def2-TZVPP
keywords: def2/J RIJCOSX
keywords: DEFGRID2
keywords: scfconv7
keywords: smallprint printgap noloewdin
keywords: NOSOSCF
formula: C22H18Cl2FNO3
InChI: InChI=1/C22H18Cl2FNO3/c1-22(2)15(11-19(23)24)20(22)21(27)29-18(12-26)13-8-9-16(25)17(10-13)28-14-6-4-3-5-7-14/h3-11,15,18,20H,1-2H3
47 atoms
Cl -2.066187 4.053008 2.4559
Cl -4.813528 4.856058 2.080432
F  3.982299 -2.985582 -2.070505
O  0.29416 1.034063 1.007444
O  0.778725 2.600394 -0.516507
O  2.287775 -3.785256 -0.092279
N  1.861426 0.180393 3.792609
C  -2.180042 2.102437 -1.430425
C  -2.114597 3.312726 -0.561056
C  -1.502182 2.021321 -0.071272
C  -1.375853 2.077294 -2.706425
C  -3.489181 1.355675 -1.530867
C  -3.321793 3.859746 0.09694
C  -0.036327 1.9475 0.077253
C  -3.388351 4.208289 1.374832
C  1.681706 0.864492 1.277626
C  2.302236 -0.171998 0.375887
C  1.7677 0.478712 2.68785
C  1.985039 -1.517859 0.5335
C  3.166551 0.218482 -0.635255
C  2.54653 -2.469735 -0.295782
C  3.737345 -0.729789 -1.472476
C  3.431816 -2.060515 -1.289806
C  1.634223 -4.498191 -1.060495
C  1.752988 -5.87932 -0.989697
C  0.858256 -3.906039 -2.046495
C  1.092907 -6.668605 -1.915414
C  0.208324 -4.711853 -2.970852
C  0.320869 -6.091185 -2.914221
H  -1.386623 4.060572 -0.866807
H  -2.055739 1.477752 0.685146
H  -1.972767 2.49162 -3.520455
H  -0.456976 2.653773 -2.642649
H  -1.113302 1.054206 -2.979781
H  -4.120258 1.789328 -2.309119
H  -3.313482 0.311669 -1.793336
H  -4.053548 1.371709 -0.598267
H  -4.207703 4.014603 -0.508052
H  2.211695 1.81458 1.160137
H  1.314238 -1.846583 1.318277
H  3.39823 1.2652 -0.778265
H  4.423468 -0.441505 -2.257175
H  2.361272 -6.323349 -0.212964
H  0.746954 -2.83069 -2.100053
H  1.189767 -7.744667 -1.858401
H  -0.393843 -4.248385 -3.741126
H  -0.188594 -6.711283 -3.638938
totalener: -2149.91262157 hartree
nucrepener: 2913.73012771 hartree
electener: -5063.64274928 hartree
oneelecener: -8740.60726573 hartree
twoeener: 3676.96451646 hartree
kineticenergy: 2143.53333061 hartree
xcener: -159.166657006066 hartree
chargesum: 0.0000000
charge: -0.027260 -0.037786 -0.183042 -0.256728 -0.388593 -0.294292 0.001692 0.111355 -0.015304 -0.167217 -0.250166 -0.266925 -0.246855 0.386950 0.092263 0.329201 -0.036138 -0.262003 -0.146926 -0.081180 0.094549 -0.164886 0.248630 0.267471 -0.209483 -0.142738 -0.090581 -0.135594 -0.144354 0.108413 0.109466 0.088517 0.102674 0.087316 0.093972 0.095990 0.090261 0.118833 0.119842 0.126498 0.123785 0.129280 0.125327 0.122197 0.125244 0.123456 0.124866
qa: -0.0273 -0.0378 -0.1830 -0.2567 -0.3886 -0.2943 0.0017 0.1114 -0.0153 -0.1672 -0.2502 -0.2669 -0.2469 0.3869 0.0923 0.3292 -0.0361 -0.2620 -0.1469 -0.0812 0.0945 -0.1649 0.2486 0.2675 -0.2095 -0.1427 -0.0906 -0.1356 -0.1444 0.1084 0.1095 0.0885 0.1027 0.0873 0.0940 0.0960 0.0903 0.1188 0.1198 0.1265 0.1238 0.1293 0.1253 0.1222 0.1252 0.1235 0.1249
va: 1.3056 1.2677 1.1187 2.1294 2.1129 2.1107 3.1155 3.7255 3.8418 3.8929 3.9008 3.9164 3.9053 4.1555 4.2085 3.8214 3.6902 4.0216 4.0406 3.9205 3.8793 3.9529 4.0394 3.7840 4.0341 3.9129 3.9503 3.9864 3.9659 1.0257 1.0240 1.0027 1.0202 1.0022 1.0015 1.0063 1.0004 1.0175 1.0202 1.0245 1.0174 1.0071 1.0143 1.0112 0.9986 1.0011 1.0003
dispcorr: -0.024353506 hartree
energy: -2149.936975075511
dipole: -1.93940 1.18396 -0.75544 -18.26974 18.40551 0.13577 -28.16763 26.19161 -1.97602
magnitude: 2.11986 au
magnitude: 5.38825 debye
