program: Orca
programVersion: 5.0.2
elementType: Cl Cl F O O O N C C C C C C C C C C C C C C C C C C C C C C H H H H H H H H H H H H H H H H H H
charge: 0
multiplicity: 1
keywords: wb97x-d3
keywords: def2-TZVPP
keywords: def2/J RIJCOSX
keywords: DEFGRID2
keywords: scfconv7
keywords: smallprint printgap noloewdin
keywords: NOSOSCF
formula: C22H18Cl2FNO3
InChI: InChI=1/C22H18Cl2FNO3/c1-22(2)15(11-19(23)24)20(22)21(27)29-18(12-26)13-8-9-16(25)17(10-13)28-14-6-4-3-5-7-14/h3-11,15,18,20H,1-2H3
47 atoms
Cl -4.672571 3.162702 -1.178759
Cl -5.500511 3.892499 1.48574
F  5.049298 -3.592577 0.179653
O  1.236476 1.33792 0.803346
O  0.162354 1.462058 -1.164425
O  2.436399 -3.506673 -0.174733
N  3.83599 3.327876 1.317729
C  -2.060118 0.102634 0.637556
C  -2.430008 1.509539 0.266982
C  -1.073401 1.233357 0.873187
C  -1.840895 -0.886833 -0.480432
C  -2.648117 -0.529988 1.875737
C  -3.412956 2.287168 1.033157
C  0.130307 1.370148 0.030815
C  -4.393792 3.012287 0.509139
C  2.499426 1.404012 0.161137
C  3.207583 0.065272 0.222601
C  3.249889 2.473578 0.822621
C  2.466717 -1.091195 -0.002309
C  4.574173 -0.023723 0.433046
C  3.085458 -2.33028 -0.020637
C  5.200767 -1.262754 0.417967
C  4.460216 -2.399246 0.19071
C  1.270437 -3.581028 -0.884572
C  1.117687 -2.977896 -2.126366
C  0.251708 -4.349717 -0.341554
C  -0.070401 -3.148097 -2.819632
C  -0.925644 -4.523067 -1.053215
C  -1.095031 -3.918832 -2.289711
H  -2.408546 1.712573 -0.797564
H  -0.925229 1.504738 1.912543
H  -2.782466 -1.38438 -0.716587
H  -1.476268 -0.427214 -1.395773
H  -1.132616 -1.663978 -0.185421
H  -2.026219 -1.364522 2.20247
H  -2.73087 0.159606 2.714869
H  -3.645769 -0.919211 1.66759
H  -3.34541 2.278206 2.114055
H  2.367855 1.694041 -0.887276
H  1.398474 -1.044697 -0.166255
H  5.167067 0.862175 0.617027
H  6.266265 -1.345584 0.583804
H  1.917571 -2.388194 -2.555442
H  0.393915 -4.818657 0.623175
H  -0.189747 -2.677942 -3.786597
H  -1.716091 -5.130143 -0.632375
H  -2.016659 -4.050391 -2.839937
totalener: -2149.91286370 hartree
nucrepener: 2964.42563259 hartree
electener: -5114.33849629 hartree
oneelecener: -8841.51471424 hartree
twoeener: 3727.17621795 hartree
kineticenergy: 2143.51512259 hartree
xcener: -159.170258071940 hartree
chargesum: 0.0000000
charge: -0.038685 -0.042606 -0.183006 -0.262508 -0.357674 -0.283126 -0.000191 0.108294 0.039138 -0.080748 -0.261533 -0.247646 -0.205457 0.299375 0.051425 0.348636 -0.069510 -0.257724 -0.126112 -0.151766 0.188983 -0.139734 0.182955 0.235208 -0.162874 -0.188202 -0.116670 -0.102897 -0.142381 0.088168 0.083553 0.099961 0.111619 0.052600 0.096808 0.075433 0.100517 0.098508 0.132493 0.119125 0.129032 0.127519 0.136141 0.128142 0.131582 0.127483 0.128352
qa: -0.0387 -0.0426 -0.1830 -0.2625 -0.3577 -0.2831 -0.0002 0.1083 0.0391 -0.0807 -0.2615 -0.2476 -0.2055 0.2994 0.0514 0.3486 -0.0695 -0.2577 -0.1261 -0.1518 0.1890 -0.1397 0.1830 0.2352 -0.1629 -0.1882 -0.1167 -0.1029 -0.1424 0.0882 0.0836 0.1000 0.1116 0.0526 0.0968 0.0754 0.1005 0.0985 0.1325 0.1191 0.1290 0.1275 0.1361 0.1281 0.1316 0.1275 0.1284
va: 1.2886 1.2628 1.1201 2.1141 2.1456 2.1307 3.1108 3.7429 3.8450 3.8598 3.9063 3.9088 3.9226 4.2863 4.2496 3.7948 3.9312 4.0256 3.9180 3.9422 3.7259 3.9413 4.0859 3.8018 3.9328 3.9807 3.8984 3.9072 3.9058 1.0506 1.0370 1.0050 1.0142 1.0084 1.0034 1.0105 1.0027 1.0294 1.0216 0.9884 1.0207 1.0079 1.0007 1.0134 0.9999 0.9998 1.0008
dispcorr: -0.026855047 hartree
energy: -2149.939718751491
dipole: 3.13771 -3.95040 -0.81269 -23.56463 22.19076 -1.37387 -1.76963 1.62702 -0.14261
magnitude: 1.60260 au
magnitude: 4.07349 debye
