program: Orca
programVersion: 5.0.2
elementType: Cl Cl F O O O N C C C C C C C C C C C C C C C C C C C C C C H H H H H H H H H H H H H H H H H H
charge: 0
multiplicity: 1
keywords: wb97x-d3
keywords: def2-TZVPP
keywords: def2/J RIJCOSX
keywords: DEFGRID2
keywords: scfconv7
keywords: smallprint printgap noloewdin
keywords: NOSOSCF
formula: C22H18Cl2FNO3
InChI: InChI=1/C22H18Cl2FNO3/c1-22(2)15(11-19(23)24)20(22)21(27)29-18(12-26)13-8-9-16(25)17(10-13)28-14-6-4-3-5-7-14/h3-11,15,18,20H,1-2H3
47 atoms
Cl -5.056418 1.733397 -0.993629
Cl -5.469415 4.335127 0.18037
F  4.237204 -2.979848 2.028963
O  1.265636 1.961181 -0.225056
O  -0.147603 0.3384 -0.839621
O  2.944782 -3.492987 -0.231115
N  4.089516 3.186731 -1.416275
C  -1.611197 1.246605 1.786544
C  -2.337089 1.76259 0.579193
C  -0.850286 2.012278 0.72023
C  -1.45559 -0.248552 1.925651
C  -1.764719 1.948501 3.115073
C  -3.268392 2.895502 0.649945
C  0.080654 1.3273 -0.198193
C  -4.437843 2.969537 0.025717
C  2.307237 1.329421 -0.966626
C  2.893181 0.174543 -0.193618
C  3.299498 2.378492 -1.212601
C  2.649534 -1.124548 -0.615037
C  3.61271 0.406893 0.972148
C  3.106091 -2.200469 0.132899
C  4.079868 -0.660384 1.719319
C  3.812789 -1.94933 1.303173
C  1.761569 -3.922717 -0.766705
C  1.841801 -4.947451 -1.698093
C  0.529674 -3.413627 -0.377945
C  0.678742 -5.467756 -2.241733
C  -0.624542 -3.937388 -0.939998
C  -0.558923 -4.963314 -1.870111
H  -2.58991 1.001171 -0.149723
H  -0.542595 3.012058 1.005293
H  -2.289387 -0.645922 2.506916
H  -1.446204 -0.764134 0.968057
H  -0.534552 -0.498011 2.456115
H  -1.79206 3.033948 3.027844
H  -2.683805 1.63273 3.610785
H  -0.929421 1.699064 3.77073
H  -2.994456 3.74776 1.259202
H  1.934704 0.982393 -1.935593
H  2.081197 -1.305151 -1.518559
H  3.816462 1.417884 1.301287
H  4.642597 -0.501519 2.629315
H  2.811264 -5.333172 -1.984001
H  0.461158 -2.615765 0.349957
H  0.743891 -6.269036 -2.965589
H  -1.583884 -3.53592 -0.641673
H  -1.464671 -5.367019 -2.301007
totalener: -2149.91348850 hartree
nucrepener: 2940.19026415 hartree
electener: -5090.10375266 hartree
oneelecener: -8793.24136102 hartree
twoeener: 3703.13760836 hartree
kineticenergy: 2143.52547923 hartree
xcener: -159.167859546276 hartree
chargesum: -0.0000000
charge: -0.038443 -0.041820 -0.181457 -0.253609 -0.381503 -0.289079 0.000861 0.078172 0.043333 -0.091585 -0.250870 -0.247538 -0.208788 0.357499 0.054613 0.314439 -0.010568 -0.259213 -0.133385 -0.162304 0.166867 -0.150924 0.197287 0.246714 -0.208924 -0.145534 -0.091829 -0.111739 -0.140104 0.087216 0.083182 0.096936 0.080407 0.093952 0.074749 0.101233 0.095541 0.098570 0.119530 0.132499 0.124620 0.129017 0.127541 0.120949 0.126371 0.121756 0.125358
qa: -0.0384 -0.0418 -0.1815 -0.2536 -0.3815 -0.2891 0.0009 0.0782 0.0433 -0.0916 -0.2509 -0.2475 -0.2088 0.3575 0.0546 0.3144 -0.0106 -0.2592 -0.1334 -0.1623 0.1669 -0.1509 0.1973 0.2467 -0.2089 -0.1455 -0.0918 -0.1117 -0.1401 0.0872 0.0832 0.0969 0.0804 0.0940 0.0747 0.1012 0.0955 0.0986 0.1195 0.1325 0.1246 0.1290 0.1275 0.1209 0.1264 0.1218 0.1254
va: 1.2890 1.2635 1.1223 2.1391 2.1168 2.1278 3.1165 3.7389 3.8309 3.8721 3.9219 3.9120 3.9266 4.2337 4.2513 3.8473 3.6568 4.0200 3.9158 3.9877 3.7949 3.9088 4.1051 3.8330 4.0266 3.9348 3.9408 3.9633 3.9719 1.0490 1.0351 1.0046 1.0194 0.9998 1.0102 1.0023 1.0038 1.0305 1.0167 1.0167 1.0149 1.0065 1.0135 1.0007 0.9988 1.0015 1.0005
dispcorr: -0.025203737 hartree
energy: -2149.938692241295
dipole: 8.30645 -9.13064 -0.82419 -15.08405 14.61261 -0.47144 9.78289 -8.89662 0.88627
magnitude: 1.29885 au
magnitude: 3.30142 debye
