program: Orca
programVersion: 5.0.2
elementType: Cl Cl F O O O N C C C C C C C C C C C C C C C C C C C C C C H H H H H H H H H H H H H H H H H H
charge: 0
multiplicity: 1
keywords: wb97x-d3
keywords: def2-TZVPP
keywords: def2/J RIJCOSX
keywords: DEFGRID2
keywords: scfconv7
keywords: smallprint printgap noloewdin
keywords: NOSOSCF
formula: C22H18Cl2FNO3
InChI: InChI=1/C22H18Cl2FNO3/c1-22(2)15(11-19(23)24)20(22)21(27)29-18(12-26)13-8-9-16(25)17(10-13)28-14-6-4-3-5-7-14/h3-11,15,18,20H,1-2H3
47 atoms
Cl -5.185884 1.466311 -0.602185
Cl -5.649285 4.100613 0.474364
F  4.231151 -2.904779 1.861195
O  1.213696 2.08209 -0.245694
O  -0.173071 0.424882 -0.826321
O  3.037128 -3.358708 -0.461086
N  4.033243 3.338173 -1.41498
C  -1.512493 1.291902 1.89279
C  -2.345985 1.728264 0.723013
C  -0.873912 2.074962 0.760418
C  -1.243699 -0.185335 2.051921
C  -1.626957 2.014913 3.213919
C  -3.337941 2.806678 0.825865
C  0.045922 1.418743 -0.189703
C  -4.55632 2.786085 0.298721
C  2.253306 1.469931 -1.005023
C  2.848009 0.298272 -0.26397
C  3.242525 2.526486 -1.228931
C  2.66083 -0.987992 -0.747971
C  3.526529 0.502598 0.931131
C  3.133384 -2.079664 -0.033686
C  4.00715 -0.580002 1.646864
C  3.795091 -1.857321 1.167977
C  1.874646 -3.846581 -0.98927
C  0.619082 -3.354734 -0.659045
C  2.007167 -4.921859 -1.857166
C  -0.504788 -3.949006 -1.214612
C  0.874792 -5.509968 -2.394483
C  -0.386872 -5.025562 -2.07947
H  -2.597147 0.933093 0.030235
H  -0.612395 3.099329 1.001616
H  -2.009003 -0.626622 2.692258
H  -1.256029 -0.7231 1.107116
H  -0.275946 -0.357049 2.527167
H  -1.726949 3.094377 3.107436
H  -2.492509 1.655966 3.772831
H  -0.739111 1.831407 3.820544
H  -3.066521 3.70202 1.371381
H  1.879073 1.146326 -1.981559
H  2.126167 -1.148127 -1.675625
H  3.687556 1.504432 1.308026
H  4.538654 -0.442139 2.578739
H  0.505018 -2.518076 0.017738
H  2.994746 -5.292769 -2.09793
H  -1.482401 -3.561138 -0.961116
H  0.982277 -6.349933 -3.06799
H  -1.269606 -5.483669 -2.503947
totalener: -2149.91323761 hartree
nucrepener: 2937.28980473 hartree
electener: -5087.20304234 hartree
oneelecener: -8787.41716154 hartree
twoeener: 3700.21411920 hartree
kineticenergy: 2143.52409608 hartree
xcener: -159.167615980619 hartree
chargesum: -0.0000000
charge: -0.038754 -0.041834 -0.180955 -0.252779 -0.378430 -0.288422 0.001559 0.074713 0.044610 -0.085841 -0.245353 -0.245334 -0.209435 0.345037 0.054071 0.316125 -0.001237 -0.259315 -0.146345 -0.167954 0.178144 -0.150374 0.196181 0.267464 -0.156338 -0.216742 -0.120852 -0.088961 -0.141037 0.087460 0.083041 0.096885 0.080830 0.092971 0.074285 0.101496 0.094821 0.097999 0.118949 0.132507 0.125275 0.129289 0.120226 0.127093 0.123953 0.126150 0.125159
qa: -0.0388 -0.0418 -0.1810 -0.2528 -0.3784 -0.2884 0.0016 0.0747 0.0446 -0.0858 -0.2454 -0.2453 -0.2094 0.3450 0.0541 0.3161 -0.0012 -0.2593 -0.1463 -0.1680 0.1781 -0.1504 0.1962 0.2675 -0.1563 -0.2167 -0.1209 -0.0890 -0.1410 0.0875 0.0830 0.0969 0.0808 0.0930 0.0743 0.1015 0.0948 0.0980 0.1189 0.1325 0.1253 0.1293 0.1202 0.1271 0.1240 0.1261 0.1252
va: 1.2887 1.2634 1.1231 2.1392 2.1223 2.1301 3.1167 3.7523 3.8287 3.8602 3.9200 3.9098 3.9252 4.2523 4.2520 3.8447 3.6396 4.0207 3.9340 3.9837 3.7866 3.9049 4.1100 3.8133 3.9312 4.0246 3.9672 3.9407 3.9686 1.0485 1.0351 1.0046 1.0191 1.0008 1.0100 1.0023 1.0039 1.0303 1.0168 1.0151 1.0153 1.0064 1.0012 1.0142 1.0006 0.9987 1.0004
dispcorr: -0.025141112 hartree
energy: -2149.938378722722
dipole: 10.20810 -10.95687 -0.74877 -13.87439 13.43998 -0.43441 8.54077 -7.66179 0.87898
magnitude: 1.23368 au
magnitude: 3.13578 debye
