program: Orca
programVersion: 5.0.2
elementType: Cl Cl F O O O N C C C C C C C C C C C C C C C C C C C C C C H H H H H H H H H H H H H H H H H H
charge: 0
multiplicity: 1
keywords: wb97x-d3
keywords: def2-TZVPP
keywords: def2/J RIJCOSX
keywords: DEFGRID2
keywords: scfconv7
keywords: smallprint printgap noloewdin
keywords: NOSOSCF
formula: C22H18Cl2FNO3
InChI: InChI=1/C22H18Cl2FNO3/c1-22(2)15(11-19(23)24)20(22)21(27)29-18(12-26)13-8-9-16(25)17(10-13)28-14-6-4-3-5-7-14/h3-11,15,18,20H,1-2H3
47 atoms
Cl -3.939591 3.798453 -1.970987
Cl -5.275331 4.67152 0.431344
F  4.167639 -3.371953 -1.167088
O  1.160642 1.603869 1.260541
O  0.542985 1.660371 -0.888682
O  2.437228 -3.305414 0.93208
N  3.921662 2.136453 2.992456
C  -2.124993 0.529046 0.437106
C  -2.291676 1.940083 -0.046591
C  -1.118152 1.590045 0.84109
C  -1.76337 -0.524603 -0.581273
C  -3.0096 0.004231 1.5428
C  -3.337781 2.83257 0.469125
C  0.244061 1.624974 0.271402
C  -4.08034 3.651783 -0.265732
C  2.519001 1.58127 0.858251
C  2.942861 0.24467 0.296623
C  3.289061 1.893804 2.065348
C  2.471536 -0.932728 0.864021
C  3.818846 0.192737 -0.774346
C  2.876888 -2.155194 0.361695
C  4.247057 -1.028729 -1.27247
C  3.775348 -2.18994 -0.700343
C  1.574898 -4.101184 0.228132
C  1.447323 -5.409706 0.674116
C  0.828445 -3.646694 -0.850269
C  0.567869 -6.265328 0.034321
C  -0.047264 -4.519596 -1.482442
C  -0.183251 -5.82777 -1.048464
H  -2.029363 2.089387 -1.087741
H  -1.173651 1.898697 1.879202
H  -1.162712 -0.13615 -1.400637
H  -1.21325 -1.344839 -0.115242
H  -2.674655 -0.944436 -1.009902
H  -3.202699 0.738122 2.324177
H  -3.973228 -0.313982 1.142472
H  -2.545159 -0.860194 2.019074
H  -3.526789 2.839119 1.535374
H  2.716396 2.364705 0.117991
H  1.787044 -0.919212 1.703064
H  4.174409 1.106604 -1.232207
H  4.936371 -1.081992 -2.104026
H  2.039988 -5.746647 1.514175
H  0.916437 -2.626975 -1.203133
H  0.475517 -7.285807 0.381683
H  -0.625836 -4.164419 -2.325061
H  -0.865431 -6.501391 -1.548547
totalener: -2149.91292492 hartree
nucrepener: 2932.31413868 hartree
electener: -5082.22706360 hartree
oneelecener: -8777.44726089 hartree
twoeener: 3695.22019729 hartree
kineticenergy: 2143.52846961 hartree
xcener: -159.166747644544 hartree
chargesum: -0.0000000
charge: -0.038189 -0.042544 -0.183590 -0.269119 -0.354689 -0.299051 0.004280 0.079386 0.042645 -0.084212 -0.257363 -0.242473 -0.205263 0.313731 0.051330 0.304195 0.033041 -0.250734 -0.185186 -0.109172 0.113336 -0.155276 0.256767 0.288484 -0.201972 -0.191285 -0.094427 -0.137498 -0.140313 0.086935 0.084995 0.102193 0.084547 0.095944 0.073942 0.100781 0.096539 0.098507 0.125721 0.129604 0.110341 0.128799 0.125751 0.132239 0.126041 0.126434 0.125847
qa: -0.0382 -0.0425 -0.1836 -0.2691 -0.3547 -0.2991 0.0043 0.0794 0.0426 -0.0842 -0.2574 -0.2425 -0.2053 0.3137 0.0513 0.3042 0.0330 -0.2507 -0.1852 -0.1092 0.1133 -0.1553 0.2568 0.2885 -0.2020 -0.1913 -0.0944 -0.1375 -0.1403 0.0869 0.0850 0.1022 0.0845 0.0959 0.0739 0.1008 0.0965 0.0985 0.1257 0.1296 0.1103 0.1288 0.1258 0.1322 0.1260 0.1264 0.1258
va: 1.2892 1.2625 1.1191 2.1146 2.1488 2.1117 3.1176 3.7638 3.8413 3.8488 3.9132 3.9075 3.9231 4.2712 4.2516 3.8386 3.6603 4.0112 3.9921 3.9885 3.8413 3.9486 4.0475 3.7531 4.0293 3.8915 3.9520 3.9869 3.9630 1.0510 1.0345 1.0160 1.0007 1.0054 1.0096 1.0028 1.0045 1.0299 1.0164 1.0266 1.0109 1.0070 1.0139 1.0068 0.9984 1.0011 0.9998
dispcorr: -0.025295037 hartree
energy: -2149.938219957133
dipole: 2.41035 -3.24541 -0.83506 -27.77012 27.01654 -0.75358 3.44013 -4.06732 -0.62719
magnitude: 1.28786 au
magnitude: 3.27347 debye
