program: Orca
programVersion: 5.0.2
elementType: Cl Cl F O O O N C C C C C C C C C C C C C C C C C C C C C C H H H H H H H H H H H H H H H H H H
charge: 0
multiplicity: 1
keywords: wb97x-d3
keywords: def2-TZVPP
keywords: def2/J RIJCOSX
keywords: DEFGRID2
keywords: scfconv7
keywords: smallprint printgap noloewdin
keywords: NOSOSCF
formula: C22H18Cl2FNO3
InChI: InChI=1/C22H18Cl2FNO3/c1-22(2)15(11-19(23)24)20(22)21(27)29-18(12-26)13-8-9-16(25)17(10-13)28-14-6-4-3-5-7-14/h3-11,15,18,20H,1-2H3
47 atoms
Cl -4.495199 3.772402 -0.68923
Cl -5.448527 3.723577 2.031729
F  4.979651 -3.692245 0.160867
O  1.173695 1.198397 0.775015
O  0.120372 1.785609 -1.120429
O  2.373115 -3.581707 -0.276356
N  3.753152 3.218863 1.371722
C  -2.141418 0.095388 0.306146
C  -2.484206 1.556047 0.27278
C  -1.137244 1.120127 0.803952
C  -1.92723 -0.612074 -1.00938
C  -2.747501 -0.800776 1.359825
C  -3.458489 2.151949 1.195203
C  0.076023 1.426492 0.022069
C  -4.344446 3.08826 0.878482
C  2.444705 1.310879 0.157258
C  3.156401 -0.025295 0.206439
C  3.177067 2.373885 0.84897
C  2.417237 -1.173341 -0.061773
C  4.515196 -0.124113 0.456198
C  3.029258 -2.414943 -0.081594
C  5.135474 -1.366738 0.439088
C  4.396535 -2.495685 0.171611
C  1.230254 -3.615923 -1.02718
C  1.178219 -3.074767 -2.305175
C  0.134877 -4.275823 -0.492133
C  0.015667 -3.205176 -3.048503
C  -1.017864 -4.409904 -1.252072
C  -1.083858 -3.873521 -2.528975
H  -2.44786 2.004065 -0.713527
H  -0.994882 1.138793 1.878594
H  -2.870513 -1.041692 -1.349935
H  -1.56337 0.044661 -1.795721
H  -1.220454 -1.436963 -0.89966
H  -2.155486 -1.711449 1.460519
H  -2.797548 -0.337555 2.344458
H  -3.760597 -1.091123 1.077334
H  -3.465966 1.811781 2.223251
H  2.323903 1.623265 -0.885994
H  1.352649 -1.116671 -0.247747
H  5.105545 0.755599 0.674759
H  6.194935 -1.458503 0.636332
H  2.038976 -2.567345 -2.721641
H  0.198511 -4.695792 0.502989
H  -0.025626 -2.786034 -4.044905
H  -1.869058 -4.934295 -0.838651
H  -1.985406 -3.97535 -3.117428
totalener: -2149.91279824 hartree
nucrepener: 2957.68732891 hartree
electener: -5107.60012715 hartree
oneelecener: -8827.98972076 hartree
twoeener: 3720.38959361 hartree
kineticenergy: 2143.52159803 hartree
xcener: -159.170524318862 hartree
chargesum: -0.0000000
charge: -0.037445 -0.043318 -0.183215 -0.266705 -0.358960 -0.284285 -0.000142 0.093420 0.043640 -0.075780 -0.207256 -0.252603 -0.207949 0.312290 0.054170 0.346475 -0.065966 -0.264066 -0.121188 -0.147607 0.176264 -0.136985 0.181425 0.221590 -0.151588 -0.186149 -0.104113 -0.096780 -0.154294 0.085767 0.083390 0.096889 0.108213 0.015497 0.092343 0.076598 0.100628 0.096727 0.134790 0.117277 0.128696 0.127655 0.135314 0.130085 0.130907 0.128236 0.128108
qa: -0.0374 -0.0433 -0.1832 -0.2667 -0.3590 -0.2843 -0.0001 0.0934 0.0436 -0.0758 -0.2073 -0.2526 -0.2079 0.3123 0.0542 0.3465 -0.0660 -0.2641 -0.1212 -0.1476 0.1763 -0.1370 0.1814 0.2216 -0.1516 -0.1861 -0.1041 -0.0968 -0.1543 0.0858 0.0834 0.0969 0.1082 0.0155 0.0923 0.0766 0.1006 0.0967 0.1348 0.1173 0.1287 0.1277 0.1353 0.1301 0.1309 0.1282 0.1281
va: 1.2901 1.2617 1.1199 2.1129 2.1478 2.1253 3.1110 3.7376 3.8494 3.8355 3.9025 3.9139 3.9311 4.2794 4.2531 3.7901 3.9206 4.0346 3.9134 3.9402 3.7247 3.9380 4.0909 3.8146 3.9461 3.9820 3.9003 3.8882 3.9169 1.0523 1.0359 1.0047 1.0220 1.0219 1.0050 1.0114 1.0017 1.0315 1.0240 0.9940 1.0210 1.0078 1.0015 1.0120 1.0000 0.9993 1.0016
dispcorr: -0.026595155 hartree
energy: -2149.939393392096
dipole: 2.20954 -3.04068 -0.83114 -24.90285 23.32146 -1.58139 -7.34052 6.95700 -0.38352
magnitude: 1.82720 au
magnitude: 4.64438 debye
