program: Orca
programVersion: 5.0.2
elementType: Cl Cl F O O O N C C C C C C C C C C C C C C C C C C C C C C H H H H H H H H H H H H H H H H H H
charge: 0
multiplicity: 1
keywords: wb97x-d3
keywords: def2-TZVPP
keywords: def2/J RIJCOSX
keywords: DEFGRID2
keywords: scfconv7
keywords: smallprint printgap noloewdin
keywords: NOSOSCF
formula: C22H18Cl2FNO3
InChI: InChI=1/C22H18Cl2FNO3/c1-22(2)15(11-19(23)24)20(22)21(27)29-18(12-26)13-8-9-16(25)17(10-13)28-14-6-4-3-5-7-14/h3-11,15,18,20H,1-2H3
47 atoms
Cl -2.862487 0.1451 2.520284
Cl -4.8180 -0.975743 0.722269
F  4.602777 -3.229135 0.408146
O  1.049241 1.895188 -0.306289
O  0.914715 2.299172 -2.508677
O  2.083872 -3.022693 -0.363667
N  3.279617 3.640668 1.424609
C  -1.843914 3.079416 -0.406333
C  -1.771971 1.632122 -0.003055
C  -1.092078 2.088122 -1.272568
C  -1.102299 4.091719 0.432529
C  -3.125295 3.624997 -0.988286
C  -2.93784 0.740234 -0.100898
C  0.375741 2.114858 -1.455932
C  -3.466768 0.070676 0.914578
C  2.462965 1.898936 -0.345599
C  3.023626 0.515332 -0.078537
C  2.913319 2.870511 0.655332
C  2.2389 -0.606685 -0.312677
C  4.342117 0.368893 0.323265
C  2.767337 -1.878227 -0.144879
C  4.878236 -0.900207 0.485577
C  4.095771 -2.007616 0.251676
C  0.717387 -2.967978 -0.482674
C  0.149006 -3.193222 -1.724744
C  -0.07243 -2.729872 0.63331
C  -1.233695 -3.187687 -1.847696
C  -1.451146 -2.723634 0.496722
C  -2.035057 -2.949775 -0.742154
H  -1.114726 1.429593 0.834043
H  -1.589361 1.844719 -2.205337
H  -1.770206 4.492642 1.196149
H  -0.236785 3.679574 0.946146
H  -0.764333 4.929474 -0.180036
H  -3.631608 2.919148 -1.645595
H  -3.822072 3.891737 -0.192353
H  -2.922393 4.524853 -1.570536
H  -3.407091 0.606336 -1.067729
H  2.807278 2.245195 -1.32665
H  1.206727 -0.507278 -0.617739
H  4.962622 1.233124 0.52179
H  5.903818 -1.032282 0.802532
H  0.78427 -3.381124 -2.580281
H  0.387518 -2.560271 1.598512
H  -1.682834 -3.370695 -2.814822
H  -2.071779 -2.5496 1.365185
H  -3.111941 -2.944285 -0.84005
totalener: -2149.91019299 hartree
nucrepener: 3091.71208350 hartree
electener: -5241.62227649 hartree
oneelecener: -9096.09174805 hartree
twoeener: 3854.46947156 hartree
kineticenergy: 2143.52209302 hartree
xcener: -159.170655013502 hartree
chargesum: -0.0000000
charge: -0.040971 -0.045579 -0.185371 -0.278410 -0.332911 -0.283644 -0.002172 0.079159 0.059701 -0.101645 -0.249769 -0.239517 -0.189880 0.320937 0.024634 0.313146 -0.008581 -0.255385 -0.123974 -0.192434 0.178142 -0.132022 0.182888 0.193023 -0.149381 -0.140388 -0.134917 -0.110496 -0.121410 0.087708 0.083668 0.091435 0.093714 0.099570 0.072172 0.098789 0.098876 0.101313 0.131940 0.117856 0.122566 0.126311 0.128562 0.133421 0.129486 0.122604 0.127233
qa: -0.0410 -0.0456 -0.1854 -0.2784 -0.3329 -0.2836 -0.0022 0.0792 0.0597 -0.1016 -0.2498 -0.2395 -0.1899 0.3209 0.0246 0.3131 -0.0086 -0.2554 -0.1240 -0.1924 0.1781 -0.1320 0.1829 0.1930 -0.1494 -0.1404 -0.1349 -0.1105 -0.1214 0.0877 0.0837 0.0914 0.0937 0.0996 0.0722 0.0988 0.0989 0.1013 0.1319 0.1179 0.1226 0.1263 0.1286 0.1334 0.1295 0.1226 0.1272
va: 1.2867 1.2614 1.1163 2.0801 2.1749 2.1200 3.1055 3.7753 3.7456 3.8832 3.9209 3.9146 3.8513 4.2742 4.2480 3.7837 3.8489 3.9840 3.8678 4.0056 3.7653 3.9275 4.1041 3.8518 4.0086 4.0027 3.9842 3.8780 3.8912 1.0457 1.0344 1.0044 1.0124 1.0009 1.0089 1.0034 1.0038 1.0260 1.0263 1.0279 1.0162 1.0075 1.0095 1.0052 0.9995 1.0201 1.0124
dispcorr: -0.028879343 hartree
energy: -2149.939072332641
dipole: -3.62758 2.41488 -1.21271 18.82608 -18.77376 0.05232 -12.53660 11.88988 -0.64671
magnitude: 1.37537 au
magnitude: 3.49591 debye
