program: Orca
programVersion: 5.0.2
elementType: Cl Cl F O O O N C C C C C C C C C C C C C C C C C C C C C C H H H H H H H H H H H H H H H H H H
charge: 0
multiplicity: 1
keywords: wb97x-d3
keywords: def2-TZVPP
keywords: def2/J RIJCOSX
keywords: DEFGRID2
keywords: scfconv7
keywords: smallprint printgap noloewdin
keywords: NOSOSCF
formula: C22H18Cl2FNO3
InChI: InChI=1/C22H18Cl2FNO3/c1-22(2)15(11-19(23)24)20(22)21(27)29-18(12-26)13-8-9-16(25)17(10-13)28-14-6-4-3-5-7-14/h3-11,15,18,20H,1-2H3
47 atoms
Cl -2.688517 3.745442 1.683914
Cl -5.473681 3.652025 0.9347
F  4.616336 -2.29538 -2.34517
O  0.556865 0.793703 1.319764
O  0.746737 2.221213 -0.393631
O  2.265854 -3.113674 -1.508341
N  2.466186 -0.16305 3.847815
C  -1.875345 0.606447 -1.195944
C  -2.185374 2.028443 -0.853745
C  -1.36881 1.210029 0.106113
C  -0.924254 0.320259 -2.331179
C  -2.952693 -0.439071 -1.036272
C  -3.557467 2.447488 -0.492429
C  0.066194 1.500542 0.279864
C  -3.862648 3.183268 0.567749
C  1.963541 0.813076 1.475736
C  2.671085 -0.010975 0.423597
C  2.222497 0.262981 2.809468
C  2.090982 -1.191777 -0.030466
C  3.900368 0.397297 -0.057656
C  2.743981 -1.967054 -0.974424
C  4.567132 -0.381576 -0.993673
C  3.990032 -1.546463 -1.440379
C  1.064511 -3.611467 -1.074793
C  0.956295 -4.211213 0.171607
C  -0.024029 -3.543625 -1.92916
C  -0.264131 -4.737588 0.565666
C  -1.238171 -4.082938 -1.527637
C  -1.363579 -4.673711 -0.279266
H  -1.615784 2.77161 -1.407243
H  -1.86558 0.847785 0.998842
H  -1.483017 0.236993 -3.26543
H  -0.171233 1.093886 -2.465487
H  -0.40651 -0.627357 -2.17041
H  -3.627727 -0.219537 -0.208826
H  -3.553678 -0.515706 -1.944842
H  -2.505652 -1.417245 -0.850969
H  -4.369829 2.15829 -1.1490
H  2.346443 1.839341 1.452412
H  1.127673 -1.504606 0.351013
H  4.346062 1.32203 0.284319
H  5.529483 -0.082397 -1.38627
H  1.817998 -4.267939 0.824472
H  0.086776 -3.087621 -2.904446
H  -0.3528 -5.204252 1.537474
H  -2.087792 -4.040377 -2.196449
H  -2.311658 -5.09097 0.03188
totalener: -2149.91060366 hartree
nucrepener: 3033.08724146 hartree
electener: -5182.99784512 hartree
oneelecener: -8979.19856962 hartree
twoeener: 3796.20072450 hartree
kineticenergy: 2143.53966628 hartree
xcener: -159.170727212124 hartree
chargesum: -0.0000000
charge: -0.029401 -0.039538 -0.185407 -0.269248 -0.351447 -0.282543 -0.000371 0.133995 -0.002982 -0.161084 -0.235398 -0.277612 -0.256816 0.331119 0.093326 0.304113 0.037974 -0.253535 -0.230007 -0.153769 0.216910 -0.130574 0.181491 0.262319 -0.172378 -0.217630 -0.107936 -0.148718 -0.106660 0.107923 0.109034 0.093275 0.107861 0.057650 0.093414 0.093517 0.092869 0.118919 0.127060 0.136365 0.107754 0.125293 0.137007 0.141529 0.133826 0.136583 0.131929
qa: -0.0294 -0.0395 -0.1854 -0.2692 -0.3514 -0.2825 -0.0004 0.1340 -0.0030 -0.1611 -0.2354 -0.2776 -0.2568 0.3311 0.0933 0.3041 0.0380 -0.2535 -0.2300 -0.1538 0.2169 -0.1306 0.1815 0.2623 -0.1724 -0.2176 -0.1079 -0.1487 -0.1067 0.1079 0.1090 0.0933 0.1079 0.0576 0.0934 0.0935 0.0929 0.1189 0.1271 0.1364 0.1078 0.1253 0.1370 0.1415 0.1338 0.1366 0.1319
va: 1.3014 1.2660 1.1155 2.1037 2.1524 2.1252 3.1219 3.7075 3.8473 3.8541 3.8861 3.9165 3.9155 4.2330 4.2077 3.8324 3.7635 4.0140 3.9255 4.0112 3.7198 3.9148 4.0965 3.7635 3.9856 3.9723 3.9386 3.8934 3.9200 1.0262 1.0248 1.0045 1.0219 1.0166 1.0029 1.0014 1.0113 1.0175 1.0182 1.0238 1.0117 1.0073 1.0044 1.0035 0.9984 0.9972 0.9981
dispcorr: -0.028149122 hartree
energy: -2149.938752782221
dipole: -0.57241 -0.45205 -1.02447 -22.22228 21.82864 -0.39364 -14.42467 13.23049 -1.19417
magnitude: 1.62189 au
magnitude: 4.12252 debye
