program: Orca
programVersion: 5.0.2
elementType: Cl Cl F O O O N C C C C C C C C C C C C C C C C C C C C C C H H H H H H H H H H H H H H H H H H
charge: 0
multiplicity: 1
keywords: wb97x-d3
keywords: def2-TZVPP
keywords: def2/J RIJCOSX
keywords: DEFGRID2
keywords: scfconv7
keywords: smallprint printgap noloewdin
keywords: NOSOSCF
formula: C22H18Cl2FNO3
InChI: InChI=1/C22H18Cl2FNO3/c1-22(2)15(11-19(23)24)20(22)21(27)29-18(12-26)13-8-9-16(25)17(10-13)28-14-6-4-3-5-7-14/h3-11,15,18,20H,1-2H3
47 atoms
Cl -2.345815 4.216454 1.101485
Cl -5.169461 3.90003 1.617301
F  4.659218 -3.554197 -0.415022
O  0.877166 1.257518 0.737114
O  0.265897 1.915131 -1.319416
O  2.435959 -2.899418 -1.797317
N  3.303786 2.831899 2.37024
C  -2.244166 0.172813 -0.543297
C  -2.574861 1.627113 -0.554818
C  -1.382305 1.158348 0.238229
C  -1.731583 -0.468889 -1.808868
C  -3.07309 -0.760059 0.305256
C  -3.765384 2.163395 0.141036
C  -0.029693 1.506673 -0.229653
C  -3.760165 3.278303 0.85934
C  2.250612 1.446719 0.42247
C  2.932691 0.108561 0.228389
C  2.831402 2.220214 1.520703
C  2.382479 -0.778638 -0.689964
C  4.083736 -0.251039 0.914352
C  2.954996 -2.019894 -0.901642
C  4.679793 -1.482811 0.687039
C  4.109124 -2.36187 -0.208361
C  1.160272 -3.350109 -1.602566
C  0.447227 -3.715675 -2.73611
C  0.592403 -3.478201 -0.341062
C  -0.835834 -4.221602 -2.602954
C  -0.695049 -3.982518 -0.225224
C  -1.416121 -4.35438 -1.349534
H  -2.316766 2.150812 -1.472345
H  -1.49057 1.108176 1.315415
H  -2.572142 -0.856881 -2.38674
H  -1.188229 0.223844 -2.44739
H  -1.080539 -1.315456 -1.583008
H  -3.406526 -0.298344 1.23501
H  -3.959157 -1.090491 -0.240489
H  -2.495381 -1.649126 0.561196
H  -4.708931 1.641967 0.030583
H  2.345911 2.0427 -0.491396
H  1.504336 -0.518388 -1.267668
H  4.531744 0.42045 1.634335
H  5.577106 -1.769075 1.218518
H  0.903941 -3.608277 -3.711028
H  1.143561 -3.199491 0.547575
H  -1.386659 -4.508776 -3.488761
H  -1.130744 -4.091746 0.759501
H  -2.417897 -4.749125 -1.24958
totalener: -2149.91182707 hartree
nucrepener: 3021.82489495 hartree
electener: -5171.73672203 hartree
oneelecener: -8956.46091864 hartree
twoeener: 3784.72419662 hartree
kineticenergy: 2143.52664767 hartree
xcener: -159.170528529170 hartree
chargesum: 0.0000000
charge: -0.027698 -0.038775 -0.181538 -0.257669 -0.367215 -0.293315 0.000324 0.175118 -0.027103 -0.149890 -0.241819 -0.287887 -0.249434 0.336556 0.090231 0.387581 -0.091652 -0.282071 -0.087860 -0.135254 0.082873 -0.149147 0.220579 0.191943 -0.157282 -0.079964 -0.114377 -0.202920 -0.116641 0.113066 0.105838 0.094722 0.111866 0.028709 0.092506 0.095392 0.094331 0.118576 0.136510 0.154194 0.132837 0.129725 0.128883 0.126912 0.126828 0.135952 0.127457
qa: -0.0277 -0.0388 -0.1815 -0.2577 -0.3672 -0.2933 0.0003 0.1751 -0.0271 -0.1499 -0.2418 -0.2879 -0.2494 0.3366 0.0902 0.3876 -0.0917 -0.2821 -0.0879 -0.1353 0.0829 -0.1491 0.2206 0.1919 -0.1573 -0.0800 -0.1144 -0.2029 -0.1166 0.1131 0.1058 0.0947 0.1119 0.0287 0.0925 0.0954 0.0943 0.1186 0.1365 0.1542 0.1328 0.1297 0.1289 0.1269 0.1268 0.1360 0.1275
va: 1.3047 1.2675 1.1228 2.1134 2.1318 2.1178 3.1151 3.6321 3.8679 3.8859 3.9000 3.9149 3.9096 4.2010 4.2103 3.7567 3.9381 4.0511 3.8885 3.9186 3.8138 3.9290 4.0991 3.8405 3.9604 3.8074 3.9549 3.9411 3.8857 1.0234 1.0263 1.0093 1.0187 1.0196 1.0035 1.0006 1.0159 1.0169 1.0219 1.0054 1.0220 1.0073 1.0123 1.0103 0.9993 0.9989 1.0003
dispcorr: -0.028550986 hartree
energy: -2149.940378057900
dipole: -5.44558 4.32230 -1.12328 -27.43046 26.05009 -1.38037 -12.74134 12.15128 -0.59006
magnitude: 1.87493 au
magnitude: 4.76570 debye
