program: Orca
programVersion: 5.0.2
elementType: Cl Cl F O O O N C C C C C C C C C C C C C C C C C C C C C C H H H H H H H H H H H H H H H H H H
charge: 0
multiplicity: 1
keywords: wb97x-d3
keywords: def2-TZVPP
keywords: def2/J RIJCOSX
keywords: DEFGRID2
keywords: scfconv7
keywords: smallprint printgap noloewdin
keywords: NOSOSCF
formula: C22H18Cl2FNO3
InChI: InChI=1/C22H18Cl2FNO3/c1-22(2)15(11-19(23)24)20(22)21(27)29-18(12-26)13-8-9-16(25)17(10-13)28-14-6-4-3-5-7-14/h3-11,15,18,20H,1-2H3
47 atoms
Cl -2.966054 5.444822 1.791149
Cl -5.580357 4.235787 1.635592
F  4.947022 -1.849314 -2.347097
O  0.04621 0.262981 0.935951
O  0.769913 2.34037 0.52344
O  2.816209 -3.333364 -1.847168
N  0.866905 -1.931095 3.27778
C  -1.699046 2.469862 -1.392892
C  -2.070817 3.074077 -0.073773
C  -1.443837 1.688567 -0.119803
C  -0.561588 3.099697 -2.159581
C  -2.774891 1.915775 -2.297431
C  -3.461221 3.207737 0.375917
C  -0.096064 1.511809 0.45575
C  -3.929159 4.16956 1.162436
C  1.309461 -0.059247 1.508252
C  2.291729 -0.529841 0.465951
C  1.043565 -1.106505 2.498173
C  2.069053 -1.735884 -0.190854
C  3.395489 0.243414 0.147603
C  2.964148 -2.187345 -1.145739
C  4.295382 -0.199048 -0.812218
C  4.079905 -1.404929 -1.440339
C  2.129042 -4.378078 -1.283625
C  2.481366 -4.882904 -0.039408
C  1.098052 -4.9442 -2.014534
C  1.781942 -5.962346 0.474827
C  0.413271 -6.032153 -1.49254
C  0.746537 -6.539943 -0.246516
H  -1.396069 3.849445 0.270249
H  -2.112408 0.852638 0.049347
H  -0.956668 3.871943 -2.821264
H  0.183477 3.560653 -1.517577
H  -0.056705 2.35883 -2.781426
H  -3.256363 2.719891 -2.855693
H  -2.337807 1.224884 -3.019243
H  -3.55181 1.370483 -1.763114
H  -4.176886 2.461153 0.05552
H  1.721554 0.805218 2.037663
H  1.20178 -2.337439 0.054412
H  3.558097 1.19266 0.639475
H  5.16807 0.385981 -1.068903
H  3.292267 -4.439121 0.523646
H  0.842769 -4.537979 -2.984293
H  2.051369 -6.354165 1.44625
H  -0.39058 -6.477601 -2.063082
H  0.205179 -7.382819 0.160697
totalener: -2149.91433999 hartree
nucrepener: 2868.65839596 hartree
electener: -5018.57273595 hartree
oneelecener: -8650.57478024 hartree
twoeener: 3632.00204429 hartree
kineticenergy: 2143.52886890 hartree
xcener: -159.167766442224 hartree
chargesum: -0.0000000
charge: -0.038187 -0.043130 -0.182818 -0.266075 -0.382686 -0.287937 -0.002040 0.070631 0.032303 -0.092533 -0.246121 -0.252128 -0.197641 0.363383 0.051708 0.334310 -0.021817 -0.265176 -0.154315 -0.109393 0.141475 -0.150920 0.195716 0.219363 -0.150731 -0.193769 -0.106005 -0.100080 -0.133948 0.087493 0.083595 0.089960 0.103028 0.088469 0.101223 0.094703 0.075541 0.096658 0.120726 0.132210 0.119431 0.126675 0.135090 0.127697 0.130650 0.127272 0.128141
qa: -0.0382 -0.0431 -0.1828 -0.2661 -0.3827 -0.2879 -0.0020 0.0706 0.0323 -0.0925 -0.2461 -0.2521 -0.1976 0.3634 0.0517 0.3343 -0.0218 -0.2652 -0.1543 -0.1094 0.1415 -0.1509 0.1957 0.2194 -0.1507 -0.1938 -0.1060 -0.1001 -0.1339 0.0875 0.0836 0.0900 0.1030 0.0885 0.1012 0.0947 0.0755 0.0967 0.1207 0.1322 0.1194 0.1267 0.1351 0.1277 0.1306 0.1273 0.1281
va: 1.2895 1.2620 1.1203 2.1354 2.1208 2.1186 3.1158 3.7552 3.8414 3.8642 3.9135 3.9126 3.9242 4.2264 4.2581 3.8294 3.7090 4.0249 3.9389 3.9290 3.7930 3.9258 4.0861 3.8211 3.9641 4.0359 3.9544 3.9372 3.9590 1.0495 1.0347 1.0009 1.0213 1.0023 1.0018 1.0042 1.0098 1.0324 1.0199 1.0166 1.0174 1.0071 1.0017 1.0116 0.9997 0.9990 0.9999
dispcorr: -0.023335269 hartree
energy: -2149.937675261294
dipole: 6.01120 -6.32523 -0.31403 -18.95532 18.99076 0.03544 -17.36884 16.24511 -1.12373
magnitude: 1.16732 au
magnitude: 2.96709 debye
