program: Orca
programVersion: 5.0.2
elementType: Cl Cl F O O O N C C C C C C C C C C C C C C C C C C C C C C H H H H H H H H H H H H H H H H H H
charge: 0
multiplicity: 1
keywords: wb97x-d3
keywords: def2-TZVPP
keywords: def2/J RIJCOSX
keywords: DEFGRID2
keywords: scfconv7
keywords: smallprint printgap noloewdin
keywords: NOSOSCF
formula: C22H18Cl2FNO3
InChI: InChI=1/C22H18Cl2FNO3/c1-22(2)15(11-19(23)24)20(22)21(27)29-18(12-26)13-8-9-16(25)17(10-13)28-14-6-4-3-5-7-14/h3-11,15,18,20H,1-2H3
47 atoms
Cl -5.560521 2.479952 1.256734
Cl -5.455641 5.297919 0.649978
F  4.334236 -2.586184 1.85916
O  0.360044 1.445291 -0.937893
O  -1.106224 0.166792 0.161288
O  2.807836 -3.929461 0.178873
N  2.341309 1.123914 -3.555039
C  -1.129753 2.749234 2.003933
C  -2.405369 2.650653 1.216827
C  -1.074338 2.544288 0.501499
C  -0.797424 1.61662 2.943732
C  -0.646336 4.089053 2.503325
C  -3.241608 3.828672 0.956371
C  -0.654376 1.256189 -0.075226
C  -4.568215 3.853663 0.957097
C  0.925098 0.285725 -1.52448
C  1.822068 -0.47376 -0.572792
C  1.713846 0.777191 -2.657703
C  1.857395 -1.858843 -0.651063
C  2.627517 0.203761 0.332315
C  2.722323 -2.577601 0.160471
C  3.470156 -0.512583 1.168426
C  3.516238 -1.88584 1.067453
C  2.639015 -4.660394 -0.969292
C  1.957293 -5.861644 -0.845388
C  3.172244 -4.265354 -2.189383
C  1.805576 -6.675794 -1.958326
C  2.999888 -5.084148 -3.296335
C  2.317699 -6.288537 -3.188615
H  -2.935058 1.711893 1.333357
H  -0.756632 3.413013 -0.064105
H  -1.17573 1.850795 3.940694
H  -1.234512 0.665189 2.648362
H  0.283418 1.483155 3.024401
H  -0.789828 4.895373 1.785009
H  -1.16432 4.36409 3.424113
H  0.421235 4.041467 2.725273
H  -2.742328 4.765528 0.739583
H  0.149394 -0.375851 -1.925849
H  1.209881 -2.376053 -1.349097
H  2.611691 1.28365 0.39734
H  4.103002 -0.005088 1.884725
H  1.554129 -6.156952 0.115016
H  3.720929 -3.33677 -2.285852
H  1.275602 -7.614306 -1.860415
H  3.412275 -4.776741 -4.248634
H  2.190784 -6.922396 -4.056241
elementType: Cl F O N C H
totalener: -2149.93873085 hartree
nucrepener: 2846.34984938 hartree
electener: -4996.28858023 hartree
oneelecener: -8605.67209827 hartree
twoeener: 3609.38351804 hartree
cpcmener: -0.03324083 hartree
kineticenergy: 2143.46324989 hartree
xcener: -159.160476964163 hartree
chargesum: -0.0000000
charge: -0.054499 -0.059620 -0.208071 -0.281496 -0.432916 -0.321335 -0.087057 0.090181 0.029246 -0.070874 -0.263035 -0.266822 -0.200908 0.369320 0.039506 0.401935 0.008907 -0.226830 -0.182886 -0.204159 0.211740 -0.164859 0.205841 0.290857 -0.250037 -0.199670 -0.116349 -0.140287 -0.185112 0.081139 0.098668 0.101181 0.096506 0.095882 0.092065 0.102813 0.098493 0.128555 0.142513 0.148636 0.149324 0.151844 0.146745 0.159038 0.158045 0.159597 0.158247
qa: -0.0545 -0.0596 -0.2081 -0.2815 -0.4329 -0.3213 -0.0871 0.0902 0.0292 -0.0709 -0.2630 -0.2668 -0.2009 0.3693 0.0395 0.4019 0.0089 -0.2268 -0.1829 -0.2042 0.2117 -0.1649 0.2058 0.2909 -0.2500 -0.1997 -0.1163 -0.1403 -0.1851 0.0811 0.0987 0.1012 0.0965 0.0959 0.0921 0.1028 0.0985 0.1286 0.1425 0.1486 0.1493 0.1518 0.1467 0.1590 0.1580 0.1596 0.1582
va: 1.2714 1.2451 1.0841 2.1184 2.0797 2.0888 3.1123 3.7438 3.8872 3.8220 3.9039 3.9064 3.8949 4.2245 4.2147 3.7222 3.6519 4.0734 3.9728 3.9179 3.7122 3.8931 4.0593 3.6892 4.0110 3.9168 3.8817 3.8884 3.9103 1.0471 1.0328 1.0009 1.0171 1.0012 1.0055 1.0006 1.0015 1.0195 1.0190 1.0037 1.0109 0.9977 1.0076 0.9958 0.9890 0.9901 0.9905
dispcorr: -0.023623302 hartree
energy: -2149.962354152123
dipole: 20.43337 -20.32554 0.10783 -11.17033 11.64639 0.47606 1.52060 -0.76170 0.75890
magnitude: 0.90233 au
magnitude: 2.29353 debye
