program: Orca
programVersion: 5.0.2
elementType: Cl Cl F O O O N C C C C C C C C C C C C C C C C C C C C C C H H H H H H H H H H H H H H H H H H
charge: 0
multiplicity: 1
keywords: wb97x-d3
keywords: def2-TZVPP
keywords: def2/J RIJCOSX
keywords: DEFGRID2
keywords: scfconv7
keywords: smallprint printgap noloewdin
keywords: NOSOSCF
formula: C22H18Cl2FNO3
InChI: InChI=1/C22H18Cl2FNO3/c1-22(2)15(11-19(23)24)20(22)21(27)29-18(12-26)13-8-9-16(25)17(10-13)28-14-6-4-3-5-7-14/h3-11,15,18,20H,1-2H3
47 atoms
Cl -5.1708 2.871034 -1.019194
Cl -5.208441 5.414378 0.342926
F  3.479933 -3.724881 1.279814
O  1.087365 2.017506 0.195223
O  -0.485462 0.752546 -0.760874
O  3.227409 -3.294792 -1.419898
N  4.202939 2.872152 -0.456261
C  -2.027376 1.593861 1.872646
C  -2.571369 2.321064 0.676704
C  -1.079854 2.332055 0.944926
C  -2.083579 0.086296 1.867274
C  -2.194724 2.184572 3.251717
C  -3.31256 3.581995 0.80427
C  -0.181444 1.604463 0.032464
C  -4.40988 3.902645 0.1303
C  2.07403 1.362088 -0.586398
C  2.404715 -0.01854 -0.069304
C  3.256504 2.223223 -0.504293
C  2.591967 -1.056446 -0.971288
C  2.54998 -0.241711 1.293321
C  2.956025 -2.313429 -0.519201
C  2.896486 -1.501715 1.75463
C  3.110554 -2.516609 0.847031
C  2.538295 -4.479443 -1.375705
C  1.26246 -4.594029 -0.842108
C  3.173994 -5.576325 -1.941637
C  0.631682 -5.831389 -0.866221
C  2.527935 -6.801953 -1.963286
C  1.256717 -6.938365 -1.420379
H  -2.878435 1.676354 -0.138931
H  -0.663227 3.246681 1.351561
H  -2.989624 -0.244514 2.378162
H  -2.100669 -0.343934 0.868168
H  -1.231359 -0.335729 2.403833
H  -3.195206 1.97627 3.635548
H  -1.476705 1.738047 3.94164
H  -2.04326 3.262871 3.280443
H  -2.936803 4.322786 1.50012
H  1.776727 1.310527 -1.639007
H  2.471095 -0.893059 -2.035647
H  2.40489 0.558116 2.007765
H  3.020435 -1.691743 2.812798
H  0.75052 -3.73908 -0.417785
H  4.167318 -5.46778 -2.358836
H  -0.362091 -5.922552 -0.447093
H  3.027543 -7.656503 -2.401086
H  0.757989 -7.898399 -1.430771
elementType: Cl F O N C H
totalener: -2149.93933310 hartree
nucrepener: 2858.74386234 hartree
electener: -5008.68319544 hartree
oneelecener: -8630.46923307 hartree
twoeener: 3621.78603764 hartree
cpcmener: -0.03334423 hartree
kineticenergy: 2143.46476880 hartree
xcener: -159.158905872321 hartree
chargesum: -0.0000000
charge: -0.055055 -0.059109 -0.206874 -0.281156 -0.436077 -0.321660 -0.086195 0.087914 0.029555 -0.070908 -0.263023 -0.264433 -0.201698 0.372376 0.040446 0.408700 -0.001415 -0.228574 -0.183427 -0.180993 0.148397 -0.171102 0.276836 0.276790 -0.174511 -0.245885 -0.157557 -0.121233 -0.183803 0.080742 0.098600 0.100084 0.095207 0.097713 0.102693 0.098838 0.090945 0.130223 0.142314 0.139753 0.150488 0.152577 0.155549 0.145553 0.158814 0.156274 0.157309
qa: -0.0551 -0.0591 -0.2069 -0.2812 -0.4361 -0.3217 -0.0862 0.0879 0.0296 -0.0709 -0.2630 -0.2644 -0.2017 0.3724 0.0404 0.4087 -0.0014 -0.2286 -0.1834 -0.1810 0.1484 -0.1711 0.2768 0.2768 -0.1745 -0.2459 -0.1576 -0.1212 -0.1838 0.0807 0.0986 0.1001 0.0952 0.0977 0.1027 0.0988 0.0909 0.1302 0.1423 0.1398 0.1505 0.1526 0.1555 0.1456 0.1588 0.1563 0.1573
va: 1.2703 1.2457 1.0839 2.1243 2.0762 2.0762 3.1129 3.7375 3.8775 3.8373 3.9057 3.9067 3.8947 4.2172 4.2143 3.7108 3.6245 4.0849 4.0296 3.9227 3.7814 3.9246 3.9741 3.6830 3.8769 3.9953 3.9096 3.8975 3.9023 1.0480 1.0324 1.0009 1.0169 1.0001 1.0007 1.0014 1.0056 1.0179 1.0185 1.0139 1.0101 0.9980 1.0017 1.0086 0.9908 0.9894 0.9903
dispcorr: -0.023695229 hartree
energy: -2149.963028331638
dipole: 9.33633 -10.35767 -1.02135 -22.46761 21.87084 -0.59677 12.03652 -10.54353 1.49299
magnitude: 1.90481 au
magnitude: 4.84165 debye
