program: Orca
programVersion: 5.0.2
elementType: Cl Cl F O O O N C C C C C C C C C C C C C C C C C C C C C C H H H H H H H H H H H H H H H H H H
charge: 0
multiplicity: 1
keywords: wb97x-d3
keywords: def2-TZVPP
keywords: def2/J RIJCOSX
keywords: DEFGRID2
keywords: scfconv7
keywords: smallprint printgap noloewdin
keywords: NOSOSCF
formula: C22H18Cl2FNO3
InChI: InChI=1/C22H18Cl2FNO3/c1-22(2)15(11-19(23)24)20(22)21(27)29-18(12-26)13-8-9-16(25)17(10-13)28-14-6-4-3-5-7-14/h3-11,15,18,20H,1-2H3
47 atoms
Cl -5.257007 2.912432 -0.90606
Cl -5.214222 5.505904 0.357104
F  3.465606 -3.720692 1.295242
O  1.060567 2.015946 0.151016
O  -0.560352 0.777999 -0.759723
O  3.249367 -3.315629 -1.414572
N  4.166588 2.813967 -0.61458
C  -2.017359 1.710123 1.897906
C  -2.586527 2.40395 0.693184
C  -1.088541 2.407352 0.920403
C  -2.086224 0.203872 1.942481
C  -2.143369 2.347286 3.260613
C  -3.312687 3.675498 0.803477
C  -0.22198 1.636645 0.011806
C  -4.438479 3.978778 0.16971
C  2.016016 1.329057 -0.641196
C  2.347785 -0.043881 -0.10263
C  3.211067 2.176881 -0.616124
C  2.570539 -1.085437 -0.992768
C  2.469061 -0.255138 1.264132
C  2.94685 -2.333383 -0.524995
C  2.828324 -1.506151 1.740801
C  3.07996 -2.523248 0.845664
C  2.608964 -4.526962 -1.342811
C  1.324724 -4.671691 -0.837395
C  3.301815 -5.618367 -1.84843
C  0.743473 -5.932911 -0.827684
C  2.704558 -6.868983 -1.83783
C  1.425997 -7.035003 -1.321347
H  -2.923931 1.736597 -0.091736
H  -0.650855 3.32978 1.285273
H  -2.130404 -0.257201 0.958101
H  -1.224535 -0.20822 2.471572
H  -2.982205 -0.10308 2.484818
H  -1.406238 1.922944 3.94424
H  -1.990098 3.425492 3.247519
H  -3.132694 2.154673 3.67982
H  -2.900483 4.439587 1.451957
H  1.68845 1.256453 -1.683717
H  2.468145 -0.932035 -2.060586
H  2.296092 0.546193 1.970359
H  2.934616 -1.686657 2.802526
H  0.770198 -3.821554 -0.45932
H  4.301213 -5.486731 -2.24399
H  -0.25639 -6.047929 -0.429501
H  3.248665 -7.719041 -2.228831
H  0.965573 -8.013973 -1.305936
elementType: Cl F O N C H
totalener: -2149.93912864 hartree
nucrepener: 2852.56462301 hartree
electener: -5002.50375166 hartree
oneelecener: -8618.10844395 hartree
twoeener: 3615.60469229 hartree
cpcmener: -0.03340583 hartree
kineticenergy: 2143.45703497 hartree
xcener: -159.157435681586 hartree
chargesum: -0.0000000
charge: -0.054904 -0.059194 -0.207096 -0.281860 -0.435168 -0.321803 -0.085836 0.087962 0.031221 -0.074716 -0.263253 -0.262943 -0.202924 0.372395 0.039980 0.403435 0.003673 -0.227793 -0.190961 -0.179092 0.150486 -0.170359 0.277878 0.270683 -0.171190 -0.243807 -0.157586 -0.122852 -0.182215 0.080860 0.099449 0.095789 0.097417 0.100166 0.098890 0.090757 0.102543 0.130900 0.143342 0.139257 0.150042 0.152465 0.156701 0.145774 0.158861 0.157172 0.157454
qa: -0.0549 -0.0592 -0.2071 -0.2819 -0.4352 -0.3218 -0.0858 0.0880 0.0312 -0.0747 -0.2633 -0.2629 -0.2029 0.3724 0.0400 0.4034 0.0037 -0.2278 -0.1910 -0.1791 0.1505 -0.1704 0.2779 0.2707 -0.1712 -0.2438 -0.1576 -0.1229 -0.1822 0.0809 0.0994 0.0958 0.0974 0.1002 0.0989 0.0908 0.1025 0.1309 0.1433 0.1393 0.1500 0.1525 0.1567 0.1458 0.1589 0.1572 0.1575
va: 1.2705 1.2456 1.0830 2.1220 2.0763 2.0757 3.1135 3.7401 3.8765 3.8388 3.9057 3.9060 3.8923 4.2179 4.2132 3.7128 3.6304 4.0831 4.0353 3.9197 3.7819 3.9255 3.9665 3.6860 3.8768 3.9970 3.9090 3.8966 3.9009 1.0480 1.0322 1.0165 1.0003 1.0011 1.0015 1.0055 1.0009 1.0175 1.0189 1.0141 1.0102 0.9982 1.0004 1.0084 0.9908 0.9891 0.9903
dispcorr: -0.023667543 hartree
energy: -2149.962796187513
dipole: 10.04192 -11.03194 -0.99002 -22.24965 21.67136 -0.57829 12.13699 -10.61268 1.52432
magnitude: 1.90738 au
magnitude: 4.84818 debye
