program: Orca
programVersion: 5.0.2
elementType: Cl Cl F O O O N C C C C C C C C C C C C C C C C C C C C C C H H H H H H H H H H H H H H H H H H
charge: 0
multiplicity: 1
keywords: wb97x-d3
keywords: def2-TZVPP
keywords: def2/J RIJCOSX
keywords: DEFGRID2
keywords: scfconv7
keywords: smallprint printgap noloewdin
keywords: NOSOSCF
formula: C22H18Cl2FNO3
InChI: InChI=1/C22H18Cl2FNO3/c1-22(2)15(11-19(23)24)20(22)21(27)29-18(12-26)13-8-9-16(25)17(10-13)28-14-6-4-3-5-7-14/h3-11,15,18,20H,1-2H3
47 atoms
Cl -5.541343 2.337385 0.457839
Cl -5.338249 5.214654 0.466555
F  4.327268 -2.743712 1.928118
O  0.683481 1.64719 -0.689796
O  -0.888103 0.164971 -0.120338
O  2.607911 -3.840912 0.254958
N  2.971812 1.883918 -3.04991
C  -1.395624 2.268876 2.16722
C  -2.453581 2.402952 1.110357
C  -0.989478 2.412899 0.712259
C  -1.268979 0.940574 2.871625
C  -1.066092 3.441074 3.059094
C  -3.226215 3.639234 0.935513
C  -0.439769 1.279638 -0.050442
C  -4.521837 3.709384 0.657612
C  1.367106 0.63078 -1.41217
C  2.162075 -0.276425 -0.503721
C  2.261592 1.348123 -2.323953
C  1.987651 -1.650604 -0.584364
C  3.056573 0.26928 0.40883
C  2.732816 -2.491658 0.230496
C  3.785422 -0.563777 1.241005
C  3.62254 -1.928818 1.13766
C  2.319262 -4.539116 -0.890009
C  1.428405 -5.59527 -0.769245
C  2.92952 -4.254967 -2.104951
C  1.144935 -6.376392 -1.880313
C  2.625434 -5.036856 -3.210192
C  1.734947 -6.097141 -3.105361
H  -2.97819 1.482037 0.881512
H  -0.567787 3.376631 0.449986
H  -1.629989 0.101282 2.282571
H  -0.230685 0.741657 3.143554
H  -1.850217 0.963335 3.794367
H  -1.788544 3.516111 3.873878
H  -0.07882 3.305633 3.503948
H  -1.054918 4.394238 2.531994
H  -2.700501 4.581733 1.032505
H  0.67467 0.046178 -2.026019
H  1.272314 -2.065216 -1.284351
H  3.196043 1.340785 0.476989
H  4.487058 -0.158419 1.958529
H  0.967521 -5.806285 0.187914
H  3.636237 -3.439362 -2.19657
H  0.452813 -7.203261 -1.784802
H  3.096974 -4.81559 -4.159126
H  1.506392 -6.704171 -3.971443
elementType: Cl F O N C H
totalener: -2149.93927303 hartree
nucrepener: 2855.69188640 hartree
electener: -5005.63115943 hartree
oneelecener: -8624.45524474 hartree
twoeener: 3618.82408531 hartree
cpcmener: -0.03246593 hartree
kineticenergy: 2143.45793854 hartree
xcener: -159.158880753271 hartree
chargesum: 0.0000000
charge: -0.054422 -0.059367 -0.207461 -0.278964 -0.439804 -0.321568 -0.086749 0.087962 0.032007 -0.076182 -0.265347 -0.265221 -0.201279 0.382786 0.039121 0.409361 -0.009448 -0.227553 -0.160609 -0.205660 0.203479 -0.165277 0.204478 0.285556 -0.248052 -0.196073 -0.118335 -0.142338 -0.182984 0.081810 0.097975 0.095702 0.099732 0.098787 0.102028 0.098653 0.091080 0.129093 0.137474 0.150213 0.149228 0.152135 0.147472 0.159276 0.158193 0.160426 0.158666
qa: -0.0544 -0.0594 -0.2075 -0.2790 -0.4398 -0.3216 -0.0867 0.0880 0.0320 -0.0762 -0.2653 -0.2652 -0.2013 0.3828 0.0391 0.4094 -0.0094 -0.2276 -0.1606 -0.2057 0.2035 -0.1653 0.2045 0.2856 -0.2481 -0.1961 -0.1183 -0.1423 -0.1830 0.0818 0.0980 0.0957 0.0997 0.0988 0.1020 0.0987 0.0911 0.1291 0.1375 0.1502 0.1492 0.1521 0.1475 0.1593 0.1582 0.1604 0.1587
va: 1.2713 1.2453 1.0850 2.1306 2.0759 2.0874 3.1122 3.7357 3.8775 3.8429 3.9050 3.9082 3.8965 4.2061 4.2148 3.7316 3.6417 4.0763 3.9292 3.9402 3.7244 3.8961 4.0645 3.6951 4.0097 3.9188 3.8823 3.8896 3.9088 1.0464 1.0329 1.0182 0.9996 1.0005 1.0008 1.0013 1.0056 1.0189 1.0187 1.0066 1.0093 0.9977 1.0072 0.9951 0.9891 0.9898 0.9903
dispcorr: -0.023364938 hartree
energy: -2149.962637971702
dipole: 16.75779 -16.84449 -0.08671 -13.72874 13.84500 0.11626 5.13929 -4.20990 0.92939
magnitude: 0.94064 au
magnitude: 2.39092 debye
