program: Gaussian 09
title: 000060478
version: EM64L-G09RevD.01
frameworkgroup: C1[X(C17H13ClN2O2)]
method: RPBEPBE
basis: SDD
operation: Freq
keyword: #p
keyword: freq=noraman
keyword: PBEPBE/SDD
title: #p freq=noraman PBEPBE/SDD
converged: YES YES NO NO
title: Mulliken charges:
elementType: Cl O O N N C C C C C C C C C C C C C C C C C H H H H H H H H H H H H H
charge: -0.062228 -0.212123 -0.221452 -0.354660 -0.441780 0.229386 0.084937 0.475821 0.176181 -0.362864 0.491843 -0.303206 -0.357456 -0.390760 -0.364212 0.431788 -0.387979 -0.396015 -0.101925 -0.209757 -0.254938 -0.801971 0.344735 0.262315 0.318630 0.295637 0.238357 0.207084 0.236850 0.235803 0.234477 0.258653 0.241628 0.230112 0.229090
chargesum: 0.00000
title: Mulliken charges with hydrogens summed into heavy atoms:
elementType: Cl O O N N C C C C C C C C C C C C C C C C C
charge: -0.062228 -0.212123 -0.221452 -0.354660 -0.097045 0.229386 0.084937 0.475821 0.176181 -0.100549 0.491843 0.015423 -0.061819 -0.152403 -0.157128 0.431788 -0.151129 -0.160212 -0.101925 0.024720 0.003715 -0.101141
polarizability: 4.55499456e+02 -1.83943397e+01 2.18622460e+02 7.09709918e-01 6.55780273e+00 9.60205983e+01
1716.lowfreq: -8.5431 -5.2452 -2.1333 -0.0009 0.0007 0.0014 7.3283 23.1026 24.3025
frequency: 6.7720 23.0702 24.1378 27.4264 58.3873 74.1565 103.4374 142.0818 150.2583 178.6249 192.2009 202.5799 229.4886 249.3698 295.2081 317.9942 336.6044 352.3936 369.5486 406.5842 409.0465 437.3254 446.8169 480.6086 516.9890 544.8117 552.9923 569.2577 603.2670 619.9759 641.3643 665.5535 679.9132 705.5702 711.5325 726.1836 738.0602 748.4988 779.4399 788.6846 818.8459 839.8871 841.6422 891.9690 905.8145 907.7114 926.9696 955.1460 977.3049 978.7807 983.3950 988.0501 1008.0998 1033.9967 1046.9030 1055.8766 1084.7698 1106.6186 1130.3139 1187.5571 1189.4090 1199.0397 1214.8748 1229.4398 1250.1391 1297.3871 1310.3219 1323.2140 1343.2474 1361.0827 1375.3989 1397.9769 1407.4522 1423.6943 1429.5389 1469.0674 1471.3462 1473.3505 1509.9460 1565.2204 1573.5203 1607.2528 1615.8756 1633.3434 1678.6496 1696.4134 2976.0560 3057.9683 3088.8539 3120.2018 3122.6973 3123.6071 3143.9455 3148.8294 3150.2455 3176.9710 3202.5099 3204.0045 3612.7993
redmass: 6.4205 2.5765 1.3907 4.1772 5.4529 5.7632 6.7252 6.5800 8.7108 5.3751 5.1775 6.6664 5.9471 6.8896 5.9559 9.2006 3.7117 3.5663 5.2855 2.8491 8.4848 3.1852 8.0982 3.6901 5.3978 1.2499 2.8338 5.3307 9.5249 6.7733 6.4170 7.3236 2.4034 9.3088 5.0880 3.2300 6.1073 7.3711 4.4197 1.4457 1.5927 3.0618 1.4142 1.4461 1.4305 1.4115 5.1525 1.3568 1.3878 1.5681 3.5872 1.4221 2.8631 6.2320 1.5738 4.5894 1.9717 1.6423 1.3797 1.2788 1.4454 1.1984 4.4212 3.2681 3.0173 1.4326 1.4866 1.6995 3.1041 4.7919 9.2479 1.2207 2.9459 2.2989 2.9064 1.1080 1.0579 2.4774 2.7481 5.4767 6.7293 6.5087 6.6440 9.7633 9.7292 9.1192 1.0392 1.0943 1.1000 1.0882 1.0873 1.0874 1.0962 1.0886 1.0968 1.0961 1.0937 1.0944 1.0802
irintensity: 0.2134 0.7997 0.3831 0.1046 0.1897 0.8073 0.9471 0.0952 5.5817 0.1888 0.5820 0.7004 2.0601 1.9236 0.3129 14.7623 0.8340 0.8143 2.4530 0.4258 12.8019 7.3228 5.6051 17.0116 8.8091 110.6703 4.7740 6.2243 92.2482 9.2983 2.1964 22.6252 26.9508 4.0965 36.5915 10.2970 2.6666 35.2843 8.4375 57.6282 35.4521 6.0113 3.9531 26.9526 25.8191 2.0652 29.8164 2.4997 2.6581 3.7976 8.4818 0.1944 2.9645 59.5611 28.1443 4.0690 18.9949 12.6461 3.8785 105.9674 59.3297 4.9161 318.6147 6.4211 27.2292 94.7217 76.2175 96.0884 428.6423 28.8341 4.7072 11.2956 22.4922 20.9966 50.5489 17.0524 15.3285 249.7127 19.2940 0.2834 30.0201 120.9781 135.5882 279.0681 110.4408 402.4310 33.6699 22.4137 15.6732 0.1956 0.8457 29.9122 36.9171 10.1892 3.9158 5.1735 2.2408 18.5472 41.2785
temp: 298.150 k
press: 1.00000 atm
elementType: 17 8 8 7 7 6 6 6 6 6 6 6 6 6 6 6 6 6 6 6 6 6 1 1 1 1 1 1 1 1 1 1 1 1 1
symmnumber: 1
zpe: 681576.9 jmol-1
zpe.correction: 0.259599 hartree
zpe.thermalcorrener: 0.278859 hartree
zpe.thermalcorrenthalpy: 0.279803 hartree
zpe.thermalcorrgfe: 0.207328 hartree
zpe.sumelectzpe: -1374.134769 hartree
zpe.sumelectthermal: -1374.115508 hartree
zpe.sumelectthermalent: -1374.114564 hartree
zpe.sumelectthermalfe: -1374.187039 hartree
dipole: 6.3521 1.6225 -0.4369
dipole: 6.5706
quadrupole: -103.6566 -139.5359 -137.6920
quadrupole: -8.9084 2.1226 0.4167
quadrupole: 23.3049 -12.5744 -10.7305 -8.9084 2.1226 0.4167
hfenergy: -1374.3943676 hartree
pointgroup: C01 [X(C17H13Cl1N2O2)]
dipole: -2.4590159 -0.7943312 -0.0698251 debye
polarizability: 455.8523361|-3.0382772|204.3045535|18.2892039|-38.2963272|109.9856248 unknown
InChI: InChI=1S/C17H13ClN2O2/c1-11-5-7-12(8-6-11)9-15-16(21)20(17(22)19-15)14-4-2-3-13(18)10-14/h2-10,19H,1H3
charge 0 multiplicity 1
35 atoms
Cl 5.948923 2.553813 0.084361
O  1.087092 1.763877 -0.749531
O  1.24376 -2.639352 1.039921
N  1.620355 -0.408346 0.15723
N  -0.500068 -1.161463 0.437561
C  -0.640448 0.12896 -0.103468
C  0.748888 0.641462 -0.293821
C  3.059657 -0.357274 0.174645
C  0.840524 -1.537704 0.598853
C  -1.754878 0.850975 -0.447876
C  -3.16998 0.51443 -0.304994
C  3.712059 0.90417 0.126686
C  3.824438 -1.552015 0.238772
C  -4.122967 1.259036 -1.062881
C  -3.67302 -0.498393 0.567727
C  -5.993778 -0.044595 -0.134646
C  -5.499441 0.981237 -0.983731
C  -5.052642 -0.765532 0.648089
C  5.115867 0.930686 0.146899
C  5.232063 -1.475736 0.262589
C  5.903131 -0.233145 0.21553
C  -7.474774 -0.364766 -0.070564
H  -1.245655 -1.833393 0.603062
H  -1.517402 1.813382 -0.920523
H  3.138217 1.828226 0.052985
H  3.324592 -2.51967 0.292973
H  -3.767268 2.057968 -1.72462
H  -3.000045 -1.035068 1.245503
H  -6.204537 1.568837 -1.58352
H  -5.41142 -1.537753 1.339137
H  5.816716 -2.399861 0.316453
H  6.994656 -0.173285 0.230122
H  -7.747717 -1.123663 -0.829892
H  -8.092322 0.52918 -0.266246
H  -7.760679 -0.771221 0.915215
