program: Orca
programVersion: 5.0.2
elementType: Cl Cl F O O O N C C C C C C C C C C C C C C C C C C C C C C H H H H H H H H H H H H H H H H H H
charge: 0
multiplicity: 1
keywords: wb97x-d3
keywords: def2-TZVPP
keywords: def2/J RIJCOSX
keywords: DEFGRID2
keywords: scfconv7
keywords: smallprint printgap noloewdin
keywords: NOSOSCF
formula: C22H18Cl2FNO3
InChI: InChI=1/C22H18Cl2FNO3/c1-22(2)15(11-19(23)24)20(22)21(27)29-18(12-26)13-8-9-16(25)17(10-13)28-14-6-4-3-5-7-14/h3-11,15,18,20H,1-2H3
47 atoms
Cl -5.477946 2.354226 0.153265
Cl -5.241659 5.221661 0.372379
F  4.256501 -2.833488 1.984212
O  0.736921 1.6425 -0.580049
O  -0.83998 0.12388 -0.130574
O  2.460078 -3.842131 0.336866
N  3.040797 2.039244 -2.899849
C  -1.487952 2.113521 2.221162
C  -2.468605 2.321567 1.104879
C  -0.979086 2.32776 0.80838
C  -1.432516 0.748517 2.862284
C  -1.20455 3.231871 3.194405
C  -3.206293 3.579772 0.940398
C  -0.400864 1.236088 0.008307
C  -4.467305 3.692069 0.542939
C  1.446404 0.673999 -1.343724
C  2.230202 -0.26812 -0.463812
C  2.33661 1.453247 -2.207457
C  1.972215 -1.630378 -0.524563
C  3.171172 0.23229 0.427791
C  2.672326 -2.504008 0.294068
C  3.858836 -0.633453 1.261932
C  3.604417 -1.986062 1.184282
C  2.157897 -4.533959 -0.808092
C  1.200571 -5.53152 -0.700714
C  2.813784 -4.299054 -2.009548
C  0.896091 -6.304127 -1.812113
C  2.48901 -5.071785 -3.115439
C  1.532417 -6.07407 -3.023967
H  -2.989018 1.424022 0.789837
H  -0.531175 3.29858 0.629533
H  -2.079775 0.735348 3.7413
H  -1.762586 -0.052879 2.205345
H  -0.419652 0.517171 3.197739
H  -1.982954 3.28082 3.958373
H  -0.254169 3.054295 3.701133
H  -1.138731 4.210299 2.719971
H  -2.681097 4.504153 1.149513
H  0.770661 0.1126 -1.997021
H  1.223074 -2.009545 -1.208882
H  3.377417 1.293924 0.481379
H  4.595728 -0.263271 1.962726
H  0.704676 -5.704372 0.246273
H  3.570771 -3.52877 -2.091022
H  0.152145 -7.085715 -1.727082
H  2.995065 -4.888483 -4.054532
H  1.287474 -6.673657 -3.890648
elementType: Cl F O N C H
totalener: -2149.93930488 hartree
nucrepener: 2861.07910288 hartree
electener: -5011.01840776 hartree
oneelecener: -8635.26274644 hartree
twoeener: 3624.24433868 hartree
cpcmener: -0.03222149 hartree
kineticenergy: 2143.46726474 hartree
xcener: -159.160358201541 hartree
chargesum: -0.0000000
charge: -0.054749 -0.059173 -0.206918 -0.277385 -0.442630 -0.323093 -0.087306 0.087847 0.030179 -0.078964 -0.264965 -0.265517 -0.200426 0.391769 0.039093 0.404248 -0.016180 -0.225820 -0.144271 -0.201418 0.194849 -0.165993 0.203700 0.279286 -0.245246 -0.189223 -0.119684 -0.144063 -0.182486 0.082480 0.097707 0.098522 0.095115 0.099999 0.101830 0.098471 0.091448 0.129037 0.136831 0.148664 0.149399 0.152164 0.147522 0.158379 0.158150 0.160194 0.158626
qa: -0.0547 -0.0592 -0.2069 -0.2774 -0.4426 -0.3231 -0.0873 0.0878 0.0302 -0.0790 -0.2650 -0.2655 -0.2004 0.3918 0.0391 0.4042 -0.0162 -0.2258 -0.1443 -0.2014 0.1948 -0.1660 0.2037 0.2793 -0.2452 -0.1892 -0.1197 -0.1441 -0.1825 0.0825 0.0977 0.0985 0.0951 0.1000 0.1018 0.0985 0.0914 0.1290 0.1368 0.1487 0.1494 0.1522 0.1475 0.1584 0.1582 0.1602 0.1586
va: 1.2708 1.2455 1.0858 2.1342 2.0737 2.0850 3.1123 3.7346 3.8771 3.8469 3.9048 3.9090 3.8956 4.1935 4.2152 3.7433 3.6416 4.0721 3.9081 3.9471 3.7279 3.8962 4.0718 3.7003 4.0076 3.9137 3.8836 3.8921 3.9078 1.0462 1.0331 1.0004 1.0185 0.9994 1.0008 1.0014 1.0056 1.0192 1.0172 1.0098 1.0075 0.9978 1.0072 0.9955 0.9892 0.9900 0.9903
dispcorr: -0.023321387 hartree
energy: -2149.962626269978
dipole: 15.43330 -15.54127 -0.10797 -14.71538 14.73159 0.01621 6.46653 -5.47017 0.99636
magnitude: 1.00232 au
magnitude: 2.54770 debye
