program: Orca
programVersion: 5.0.2
elementType: Cl Cl F O O O N C C C C C C C C C C C C C C C C C C C C C C H H H H H H H H H H H H H H H H H H
charge: 0
multiplicity: 1
keywords: wb97x-d3
keywords: def2-TZVPP
keywords: def2/J RIJCOSX
keywords: DEFGRID2
keywords: scfconv7
keywords: smallprint printgap noloewdin
keywords: NOSOSCF
formula: C22H18Cl2FNO3
InChI: InChI=1/C22H18Cl2FNO3/c1-22(2)15(11-19(23)24)20(22)21(27)29-18(12-26)13-8-9-16(25)17(10-13)28-14-6-4-3-5-7-14/h3-11,15,18,20H,1-2H3
47 atoms
Cl -5.080279 3.88249 -0.907737
Cl -4.617802 6.323206 0.562107
F  1.353664 -4.388176 1.302729
O  0.993985 1.773354 0.231311
O  -0.762827 0.962078 -0.883922
O  1.469594 -3.895819 -1.375892
N  4.277228 1.762427 -0.147022
C  -2.189154 1.916409 1.769751
C  -2.546622 2.812087 0.617953
C  -1.091524 2.519781 0.909514
C  -2.532996 0.451656 1.655786
C  -2.286189 2.435702 3.183702
C  -3.042826 4.177592 0.833839
C  -0.323629 1.674623 -0.019931
C  -4.098171 4.7139 0.235861
C  1.838349 0.891458 -0.493958
C  1.726329 -0.532484 -0.000064
C  3.196721 1.401759 -0.29166
C  1.676354 -1.572657 -0.917441
C  1.680292 -0.798034 1.362422
C  1.566058 -2.87945 -0.476103
C  1.555329 -2.10345 1.810721
C  1.489385 -3.125633 0.889113
C  2.433006 -4.87274 -1.376348
C  3.715273 -4.665585 -0.887887
C  2.071322 -6.094835 -1.927175
C  4.633191 -5.705888 -0.940003
C  3.002226 -7.119937 -1.978376
C  4.284737 -6.935065 -1.479034
H  -2.950336 2.295316 -0.245431
H  -0.517557 3.307256 1.385311
H  -3.501492 0.269531 2.124721
H  -2.601655 0.101271 0.628589
H  -1.795852 -0.163366 2.175977
H  -3.320064 2.399241 3.532064
H  -1.689886 1.814255 3.853911
H  -1.933388 3.460484 3.292681
H  -2.511538 4.805424 1.539188
H  1.632266 0.936642 -1.568598
H  1.714975 -1.375048 -1.982026
H  1.733307 0.00357 2.087676
H  1.504308 -2.325675 2.868489
H  4.013154 -3.710706 -0.473327
H  1.068253 -6.240127 -2.307465
H  5.631304 -5.545022 -0.554409
H  2.717106 -8.073323 -2.403825
H  5.005556 -7.740852 -1.51232
elementType: Cl F O N C H
totalener: -2149.93877993 hartree
nucrepener: 2847.89182255 hartree
electener: -4997.83060248 hartree
oneelecener: -8608.85333180 hartree
twoeener: 3611.02272932 hartree
cpcmener: -0.03331332 hartree
kineticenergy: 2143.47946116 hartree
xcener: -159.161522849725 hartree
chargesum: 0.0000000
charge: -0.054946 -0.059064 -0.206851 -0.280325 -0.431592 -0.324665 -0.086291 0.091371 0.035410 -0.076291 -0.265967 -0.261285 -0.204899 0.360512 0.039400 0.408585 0.014373 -0.227669 -0.185976 -0.195258 0.146377 -0.165510 0.276266 0.267861 -0.164907 -0.236606 -0.164766 -0.125532 -0.181125 0.082884 0.100207 0.101194 0.097107 0.096171 0.102310 0.098258 0.090843 0.131159 0.141941 0.139711 0.150479 0.153232 0.154066 0.146055 0.159091 0.157007 0.157655
qa: -0.0549 -0.0591 -0.2069 -0.2803 -0.4316 -0.3247 -0.0863 0.0914 0.0354 -0.0763 -0.2660 -0.2613 -0.2049 0.3605 0.0394 0.4086 0.0144 -0.2277 -0.1860 -0.1953 0.1464 -0.1655 0.2763 0.2679 -0.1649 -0.2366 -0.1648 -0.1255 -0.1811 0.0829 0.1002 0.1012 0.0971 0.0962 0.1023 0.0983 0.0908 0.1312 0.1419 0.1397 0.1505 0.1532 0.1541 0.1461 0.1591 0.1570 0.1577
va: 1.2705 1.2462 1.0847 2.1215 2.0800 2.0741 3.1122 3.7351 3.8712 3.8381 3.9041 3.9049 3.8914 4.2363 4.2131 3.7096 3.6069 4.0840 4.0350 3.9238 3.7811 3.9138 3.9867 3.6858 3.8646 3.9910 3.9185 3.9026 3.8986 1.0466 1.0323 1.0012 1.0167 1.0004 1.0008 1.0016 1.0053 1.0168 1.0173 1.0138 1.0105 0.9977 1.0014 1.0082 0.9908 0.9891 0.9902
dispcorr: -0.024101076 hartree
energy: -2149.962881009483
dipole: 16.53212 -16.83192 -0.29980 -24.06123 23.72387 -0.33736 10.27466 -8.91195 1.36271
magnitude: 1.43550 au
magnitude: 3.64875 debye
