program: Orca
programVersion: 5.0.2
elementType: Cl Cl F O O O N C C C C C C C C C C C C C C C C C C C C C C H H H H H H H H H H H H H H H H H H
charge: 0
multiplicity: 1
keywords: wb97x-d3
keywords: def2-TZVPP
keywords: def2/J RIJCOSX
keywords: DEFGRID2
keywords: scfconv7
keywords: smallprint printgap noloewdin
keywords: NOSOSCF
formula: C22H18Cl2FNO3
InChI: InChI=1/C22H18Cl2FNO3/c1-22(2)15(11-19(23)24)20(22)21(27)29-18(12-26)13-8-9-16(25)17(10-13)28-14-6-4-3-5-7-14/h3-11,15,18,20H,1-2H3
47 atoms
Cl -4.909314 3.247522 -1.204947
Cl -5.11525 5.362371 0.745849
F  3.71815 -3.778241 0.959104
O  1.145854 1.939518 0.455063
O  -0.303708 0.921104 -0.906391
O  2.980356 -3.200311 -1.606759
N  4.245634 3.037693 0.113204
C  -2.155532 1.183954 1.623146
C  -2.539481 2.204509 0.591415
C  -1.092677 2.09179 1.030788
C  -2.229628 -0.271615 1.232041
C  -2.488449 1.421203 3.076471
C  -3.283269 3.420941 0.942297
C  -0.092611 1.579194 0.079081
C  -4.291467 3.933619 0.248334
C  2.219179 1.453022 -0.342241
C  2.592664 0.035718 0.017662
C  3.34165 2.356129 -0.079207
C  2.562331 -0.955765 -0.953622
C  2.963318 -0.273999 1.320559
C  2.938177 -2.249723 -0.634615
C  3.333322 -1.567223 1.649061
C  3.332071 -2.53438 0.666729
C  2.229932 -4.340758 -1.468489
C  1.072913 -4.395397 -0.704031
C  2.669877 -5.453472 -2.173106
C  0.364224 -5.588039 -0.638336
C  1.946372 -6.633558 -2.10298
C  0.794051 -6.710255 -1.331092
H  -2.747238 1.793559 -0.390025
H  -0.726654 2.863419 1.698805
H  -3.19546 -0.678213 1.536909
H  -2.132905 -0.437881 0.161792
H  -1.454795 -0.851157 1.737932
H  -1.864045 0.791427 3.712281
H  -2.333968 2.452529 3.390975
H  -3.530083 1.162613 3.275914
H  -2.991614 3.9525 1.840381
H  1.985295 1.526618 -1.408745
H  2.262772 -0.727125 -1.969286
H  2.981688 0.48975 2.08824
H  3.638246 -1.820632 2.655947
H  0.711374 -3.527332 -0.166677
H  3.572831 -5.392551 -2.76772
H  -0.536182 -5.632267 -0.039177
H  2.293618 -7.50036 -2.650443
H  0.236358 -7.63546 -1.27168
elementType: Cl F O N C H
totalener: -2149.93950178 hartree
nucrepener: 2868.92160048 hartree
electener: -5018.86110226 hartree
oneelecener: -8650.80726325 hartree
twoeener: 3631.94616099 hartree
cpcmener: -0.03232333 hartree
kineticenergy: 2143.46523420 hartree
xcener: -159.158728944592 hartree
chargesum: -0.0000000
charge: -0.054618 -0.058936 -0.205744 -0.279882 -0.442976 -0.322911 -0.086242 0.087793 0.034768 -0.084367 -0.267828 -0.262791 -0.204563 0.392171 0.040552 0.412652 -0.017646 -0.229728 -0.165307 -0.177423 0.142252 -0.171466 0.274758 0.270067 -0.168181 -0.240430 -0.162434 -0.124571 -0.180327 0.082238 0.098152 0.099232 0.095585 0.100053 0.098153 0.090856 0.102256 0.130616 0.137679 0.140202 0.151826 0.152468 0.156008 0.145334 0.158213 0.157350 0.157140
qa: -0.0546 -0.0589 -0.2057 -0.2799 -0.4430 -0.3229 -0.0862 0.0878 0.0348 -0.0844 -0.2678 -0.2628 -0.2046 0.3922 0.0406 0.4127 -0.0176 -0.2297 -0.1653 -0.1774 0.1423 -0.1715 0.2748 0.2701 -0.1682 -0.2404 -0.1624 -0.1246 -0.1803 0.0822 0.0982 0.0992 0.0956 0.1001 0.0982 0.0909 0.1023 0.1306 0.1377 0.1402 0.1518 0.1525 0.1560 0.1453 0.1582 0.1573 0.1571
va: 1.2708 1.2458 1.0858 2.1338 2.0708 2.0760 3.1121 3.7348 3.8700 3.8586 3.9067 3.9074 3.8967 4.1976 4.2138 3.7169 3.6206 4.0841 3.9985 3.9437 3.7914 3.9319 3.9824 3.6862 3.8684 3.9936 3.9153 3.8979 3.9001 1.0466 1.0327 1.0005 1.0177 0.9992 1.0016 1.0058 1.0008 1.0176 1.0186 1.0167 1.0070 0.9984 1.0003 1.0086 0.9910 0.9890 0.9904
dispcorr: -0.023637345 hartree
energy: -2149.963139124091
dipole: 6.42240 -7.46609 -1.04368 -25.89101 24.89855 -0.99246 10.21905 -8.75740 1.46164
magnitude: 2.05199 au
magnitude: 5.21574 debye
