program: Orca
programVersion: 5.0.2
elementType: Cl Cl F O O O N C C C C C C C C C C C C C C C C C C C C C C H H H H H H H H H H H H H H H H H H
charge: 0
multiplicity: 1
keywords: wb97x-d3
keywords: def2-TZVPP
keywords: def2/J RIJCOSX
keywords: DEFGRID2
keywords: scfconv7
keywords: smallprint printgap noloewdin
keywords: NOSOSCF
formula: C22H18Cl2FNO3
InChI: InChI=1/C22H18Cl2FNO3/c1-22(2)15(11-19(23)24)20(22)21(27)29-18(12-26)13-8-9-16(25)17(10-13)28-14-6-4-3-5-7-14/h3-11,15,18,20H,1-2H3
47 atoms
Cl -5.373915 2.669339 -0.016862
Cl -4.962472 5.523834 -0.010679
F  4.428071 -2.844179 1.874885
O  0.538193 1.429081 -0.589937
O  -0.999318 0.059039 0.274424
O  2.621305 -4.039693 0.362792
N  2.436299 1.381554 -3.282324
C  -1.484074 2.381827 2.308481
C  -2.45646 2.537114 1.17897
C  -0.969737 2.380198 0.883938
C  -1.539262 1.108495 3.117713
C  -1.095925 3.583034 3.137499
C  -3.092342 3.81871 0.855312
C  -0.519695 1.16005 0.196062
C  -4.310019 3.97132 0.34988
C  1.0917 0.332818 -1.302326
C  1.99346 -0.513433 -0.436245
C  1.842256 0.93605 -2.406055
C  1.859078 -1.893851 -0.464455
C  2.945361 0.085846 0.378511
C  2.698073 -2.687503 0.304039
C  3.765628 -0.701025 1.171262
C  3.638985 -2.07289 1.120603
C  2.328964 -4.768781 -0.761401
C  1.531752 -5.88966 -0.585146
C  2.844253 -4.449561 -2.01087
C  1.244839 -6.698842 -1.674791
C  2.536867 -5.261261 -3.093429
C  1.738349 -6.385491 -2.933462
H  -3.04604 1.651578 0.970839
H  -0.447544 3.281777 0.58527
H  -2.141687 1.27812 4.012076
H  -1.982227 0.272094 2.582342
H  -0.541538 0.811607 3.446318
H  -0.934766 4.482594 2.544546
H  -1.866898 3.802259 3.878478
H  -0.167956 3.381641 3.675589
H  -2.522119 4.724004 1.026416
H  0.307155 -0.287398 -1.747963
H  1.1002 -2.350026 -1.08891
H  3.057153 1.162103 0.406521
H  4.509866 -0.251998 1.816103
H  1.143833 -6.126849 0.397455
H  3.480118 -3.584039 -2.148649
H  0.62429 -7.574637 -1.535726
H  2.934106 -5.011878 -4.068757
H  1.505989 -7.014044 -3.782896
elementType: Cl F O N C H
totalener: -2149.93886736 hartree
nucrepener: 2846.84250512 hartree
electener: -4996.78137248 hartree
oneelecener: -8606.74325175 hartree
twoeener: 3609.96187927 hartree
cpcmener: -0.03261517 hartree
kineticenergy: 2143.46922138 hartree
xcener: -159.160969716612 hartree
chargesum: -0.0000000
charge: -0.054199 -0.058872 -0.207509 -0.284019 -0.442444 -0.322627 -0.087567 0.093728 0.022710 -0.072984 -0.265961 -0.272500 -0.197276 0.388230 0.040778 0.404632 0.003655 -0.224417 -0.169204 -0.200605 0.201281 -0.167218 0.205120 0.288864 -0.250919 -0.195136 -0.116824 -0.142772 -0.185133 0.084444 0.096821 0.096969 0.095841 0.100238 0.092574 0.102722 0.098741 0.128236 0.138059 0.150853 0.149584 0.152256 0.146967 0.158574 0.157987 0.159909 0.158412
qa: -0.0542 -0.0589 -0.2075 -0.2840 -0.4424 -0.3226 -0.0876 0.0937 0.0227 -0.0730 -0.2660 -0.2725 -0.1973 0.3882 0.0408 0.4046 0.0037 -0.2244 -0.1692 -0.2006 0.2013 -0.1672 0.2051 0.2889 -0.2509 -0.1951 -0.1168 -0.1428 -0.1851 0.0844 0.0968 0.0970 0.0958 0.1002 0.0926 0.1027 0.0987 0.1282 0.1381 0.1509 0.1496 0.1523 0.1470 0.1586 0.1580 0.1599 0.1584
va: 1.2717 1.2461 1.0853 2.1270 2.0725 2.0873 3.1124 3.7240 3.8873 3.8452 3.9023 3.9143 3.9008 4.1843 4.2168 3.7319 3.6416 4.0744 3.9460 3.9385 3.7192 3.8942 4.0671 3.6927 4.0080 3.9113 3.8826 3.8902 3.9096 1.0448 1.0329 1.0003 1.0186 0.9994 1.0054 1.0001 1.0012 1.0200 1.0207 1.0041 1.0096 0.9976 1.0075 0.9956 0.9890 0.9901 0.9903
dispcorr: -0.023084362 hartree
energy: -2149.961951717586
dipole: 14.80382 -14.87548 -0.07166 -14.64671 14.88956 0.24285 8.80404 -7.61072 1.19332
magnitude: 1.21988 au
magnitude: 3.10069 debye
