program: Orca
programVersion: 5.0.2
elementType: Cl Cl F O O O N C C C C C C C C C C C C C C C C C C C C C C H H H H H H H H H H H H H H H H H H
charge: 0
multiplicity: 1
keywords: wb97x-d3
keywords: def2-TZVPP
keywords: def2/J RIJCOSX
keywords: DEFGRID2
keywords: scfconv7
keywords: smallprint printgap noloewdin
keywords: NOSOSCF
formula: C22H18Cl2FNO3
InChI: InChI=1/C22H18Cl2FNO3/c1-22(2)15(11-19(23)24)20(22)21(27)29-18(12-26)13-8-9-16(25)17(10-13)28-14-6-4-3-5-7-14/h3-11,15,18,20H,1-2H3
47 atoms
Cl -3.309176 5.676202 0.9903
Cl -5.76198 4.178674 1.243494
F  4.394496 -2.04126 -2.862677
O  0.228006 0.261036 1.040342
O  0.742018 2.425631 0.768503
O  3.028939 -3.747232 -1.405392
N  1.275343 -1.654177 3.528317
C  -1.649906 2.239185 -1.262551
C  -2.08057 2.95278 -0.013511
C  -1.401882 1.60237 0.093654
C  -0.512929 2.835788 -2.055174
C  -2.67575 1.555636 -2.133432
C  -3.493823 3.055635 0.372984
C  -0.045118 1.52128 0.66063
C  -4.095296 4.155788 0.807685
C  1.548378 -0.024479 1.505652
C  2.372023 -0.601608 0.383036
C  1.380219 -0.945066 2.631012
C  2.298872 -1.954839 0.064024
C  3.142197 0.259464 -0.38571
C  2.988886 -2.447083 -1.032277
C  3.831539 -0.226398 -1.486662
C  3.740802 -1.562205 -1.800796
C  2.053203 -4.621337 -0.989259
C  2.457766 -5.767259 -0.323685
C  0.71536 -4.397538 -1.284281
C  1.50587 -6.706997 0.048248
C  -0.226005 -5.339634 -0.896606
C  0.163471 -6.495145 -0.231385
H  -1.456331 3.796382 0.25882
H  -2.038732 0.755118 0.321124
H  -0.917527 3.49266 -2.827415
H  0.172193 3.428545 -1.453659
H  0.063278 2.055504 -2.55648
H  -2.191688 0.809803 -2.766273
H  -3.451221 1.044363 -1.564618
H  -3.163222 2.279587 -2.789097
H  -4.103997 2.162922 0.302903
H  2.028937 0.875937 1.898513
H  1.710441 -2.630638 0.673489
H  3.209417 1.309859 -0.137267
H  4.432959 0.430876 -2.101101
H  3.506487 -5.926092 -0.105861
H  0.408602 -3.504014 -1.81414
H  1.819037 -7.60534 0.564354
H  -1.270453 -5.170587 -1.124346
H  -0.57596 -7.228088 0.063216
elementType: Cl F O N C H
totalener: -2149.93874030 hartree
nucrepener: 2866.74962691 hartree
electener: -5016.68836721 hartree
oneelecener: -8646.38773116 hartree
twoeener: 3629.69936395 hartree
cpcmener: -0.03075041 hartree
kineticenergy: 2143.45437822 hartree
xcener: -159.157505246888 hartree
chargesum: -0.0000000
charge: -0.054647 -0.059225 -0.207607 -0.274843 -0.442981 -0.319209 -0.087316 0.090946 0.036693 -0.097759 -0.271335 -0.261346 -0.204224 0.405239 0.038942 0.391204 -0.031766 -0.222036 -0.163783 -0.172900 0.201908 -0.157981 0.198839 0.254007 -0.219158 -0.186960 -0.130495 -0.141431 -0.168826 0.081614 0.098029 0.099896 0.096182 0.099792 0.099304 0.090133 0.101801 0.131279 0.135353 0.141406 0.148785 0.150830 0.147579 0.159360 0.158764 0.159217 0.158726
qa: -0.0546 -0.0592 -0.2076 -0.2748 -0.4430 -0.3192 -0.0873 0.0909 0.0367 -0.0978 -0.2713 -0.2613 -0.2042 0.4052 0.0389 0.3912 -0.0318 -0.2220 -0.1638 -0.1729 0.2019 -0.1580 0.1988 0.2540 -0.2192 -0.1870 -0.1305 -0.1414 -0.1688 0.0816 0.0980 0.0999 0.0962 0.0998 0.0993 0.0901 0.1018 0.1313 0.1354 0.1414 0.1488 0.1508 0.1476 0.1594 0.1588 0.1592 0.1587
va: 1.2705 1.2457 1.0843 2.1236 2.0690 2.0838 3.1080 3.7309 3.8597 3.8653 3.9064 3.9057 3.8913 4.1872 4.2133 3.7397 3.7720 4.0739 3.9685 3.8812 3.7580 3.8961 4.0524 3.7161 4.0089 3.9365 3.8862 3.8873 3.8992 1.0469 1.0334 1.0009 1.0176 0.9994 1.0015 1.0055 1.0011 1.0171 1.0229 1.0113 1.0108 0.9982 1.0056 0.9952 0.9893 0.9900 0.9902
dispcorr: -0.023458992 hartree
energy: -2149.962199292341
dipole: 6.88678 -7.44804 -0.56126 -20.68352 20.41438 -0.26914 -13.84725 12.28314 -1.56411
magnitude: 1.68341 au
magnitude: 4.27890 debye
