program: Orca
programVersion: 5.0.2
elementType: Cl Cl F O O O N C C C C C C C C C C C C C C C C C C C C C C H H H H H H H H H H H H H H H H H H
charge: 0
multiplicity: 1
keywords: wb97x-d3
keywords: def2-TZVPP
keywords: def2/J RIJCOSX
keywords: DEFGRID2
keywords: scfconv7
keywords: smallprint printgap noloewdin
keywords: NOSOSCF
formula: C22H18Cl2FNO3
InChI: InChI=1/C22H18Cl2FNO3/c1-22(2)15(11-19(23)24)20(22)21(27)29-18(12-26)13-8-9-16(25)17(10-13)28-14-6-4-3-5-7-14/h3-11,15,18,20H,1-2H3
47 atoms
Cl -3.359279 -0.123934 1.449188
Cl -4.682106 -0.95029 -0.978549
F  4.309428 -2.833816 -1.349144
O  0.917497 2.190109 0.263355
O  1.512959 2.644664 -1.838216
O  1.825328 -2.790997 -0.504256
N  2.341139 1.961118 3.21978
C  -1.815345 3.382973 -0.656304
C  -1.833233 1.9040 -0.388819
C  -0.795024 2.484838 -1.327535
C  -1.410679 4.297427 0.473285
C  -2.85262 3.99184 -1.56765
C  -2.851404 1.003121 -0.946032
C  0.647571 2.464611 -1.021127
C  -3.529278 0.100719 -0.24772
C  2.279671 1.996491 0.607628
C  2.828496 0.695878 0.067927
C  2.298285 1.983524 2.072442
C  2.025423 -0.441222 0.071719
C  4.125334 0.645671 -0.411777
C  2.525771 -1.636982 -0.415003
C  4.636034 -0.554129 -0.889553
C  3.836892 -1.67249 -0.885763
C  0.662823 -2.938052 0.217363
C  -0.527502 -3.074164 -0.477639
C  0.700226 -3.006874 1.602249
C  -1.701136 -3.296124 0.230154
C  -0.480945 -3.220874 2.297436
C  -1.68183 -3.366973 1.615653
H  -1.467434 1.628231 0.59293
H  -0.969262 2.333362 -2.387325
H  -0.900265 5.183175 0.090212
H  -2.300778 4.636166 1.00636
H  -0.75995 3.82242 1.204325
H  -3.092087 3.361882 -2.423674
H  -3.778535 4.177931 -1.020102
H  -2.499571 4.948848 -1.955717
H  -3.058717 1.060383 -2.008137
H  2.901407 2.834344 0.275161
H  1.009193 -0.394537 0.444111
H  4.743656 1.533631 -0.420133
H  5.648039 -0.616868 -1.267768
H  -0.534369 -3.016655 -1.558815
H  1.639349 -2.902974 2.131947
H  -2.634047 -3.4068 -0.306844
H  -0.458465 -3.278574 3.377887
H  -2.599249 -3.53698 2.163256
elementType: Cl F O N C H
totalener: -2149.93613707 hartree
nucrepener: 3093.90821776 hartree
electener: -5243.84435484 hartree
oneelecener: -9101.04677720 hartree
twoeener: 3857.20242236 hartree
cpcmener: -0.03300126 hartree
kineticenergy: 2143.47893583 hartree
xcener: -159.164034384157 hartree
chargesum: -0.0000000
charge: -0.057415 -0.062094 -0.209113 -0.280048 -0.427065 -0.321862 -0.084914 0.089838 0.053704 -0.094527 -0.264135 -0.263616 -0.229274 0.390594 0.061629 0.368189 -0.011127 -0.227568 -0.161217 -0.198035 0.203149 -0.145066 0.192300 0.252817 -0.206724 -0.176185 -0.143039 -0.133440 -0.172092 0.086221 0.098765 0.102234 0.096801 0.094351 0.089601 0.100898 0.099638 0.133843 0.147256 0.140776 0.145973 0.150982 0.146943 0.155982 0.151337 0.159678 0.155057
qa: -0.0574 -0.0621 -0.2091 -0.2800 -0.4271 -0.3219 -0.0849 0.0898 0.0537 -0.0945 -0.2641 -0.2636 -0.2293 0.3906 0.0616 0.3682 -0.0111 -0.2276 -0.1612 -0.1980 0.2031 -0.1451 0.1923 0.2528 -0.2067 -0.1762 -0.1430 -0.1334 -0.1721 0.0862 0.0988 0.1022 0.0968 0.0944 0.0896 0.1009 0.0996 0.1338 0.1473 0.1408 0.1460 0.1510 0.1469 0.1560 0.1513 0.1597 0.1551
va: 1.2645 1.2428 1.0818 2.1122 2.0838 2.0858 3.1079 3.7459 3.8027 3.8746 3.9130 3.9113 3.9085 4.1785 4.1815 3.7671 3.6970 4.0667 3.9071 3.9517 3.7204 3.8791 4.0495 3.7047 3.9812 3.9508 3.8252 3.8829 3.8539 1.0385 1.0298 0.9998 1.0008 1.0111 1.0049 1.0010 1.0015 1.0160 1.0142 1.0176 1.0013 0.9976 1.0051 0.9971 1.0016 0.9887 0.9951
dispcorr: -0.028072458 hartree
energy: -2149.964209529257
dipole: -0.86166 -0.07979 -0.94145 21.10374 -19.79248 1.31127 -1.36212 0.52536 -0.83676
magnitude: 1.81822 au
magnitude: 4.62154 debye
