program: Orca
programVersion: 5.0.2
elementType: Cl Cl F O O O N C C C C C C C C C C C C C C C C C C C C C C H H H H H H H H H H H H H H H H H H
charge: 0
multiplicity: 1
keywords: wb97x-d3
keywords: def2-TZVPP
keywords: def2/J RIJCOSX
keywords: DEFGRID2
keywords: scfconv7
keywords: smallprint printgap noloewdin
keywords: NOSOSCF
formula: C22H18Cl2FNO3
InChI: InChI=1/C22H18Cl2FNO3/c1-22(2)15(11-19(23)24)20(22)21(27)29-18(12-26)13-8-9-16(25)17(10-13)28-14-6-4-3-5-7-14/h3-11,15,18,20H,1-2H3
47 atoms
Cl -5.421149 2.990127 -0.070779
Cl -4.768576 5.791612 0.141127
F  4.148639 -3.096672 1.99444
O  0.514245 1.366057 -0.516918
O  -1.146871 0.016066 0.124283
O  2.266445 -4.172371 0.445797
N  2.626051 1.398608 -3.053915
C  -1.659474 2.202547 2.299355
C  -2.538428 2.52322 1.127358
C  -1.051027 2.282385 0.914047
C  -1.869728 0.874753 2.985345
C  -1.244064 3.294198 3.256081
C  -3.0572 3.874231 0.885334
C  -0.612763 1.093685 0.165064
C  -4.250821 4.166436 0.384519
C  1.095638 0.294644 -1.246713
C  1.914141 -0.61457 -0.362487
C  1.94637 0.93257 -2.254251
C  1.689385 -1.982256 -0.393662
C  2.884136 -0.080352 0.478276
C  2.454159 -2.828518 0.397091
C  3.634685 -0.917521 1.285564
C  3.419338 -2.279587 1.229785
C  2.111312 -4.880467 -0.718936
C  1.24432 -5.962522 -0.680165
C  2.81804 -4.574583 -1.874768
C  1.083822 -6.746657 -1.813115
C  2.637379 -5.361625 -3.003277
C  1.772992 -6.447435 -2.980306
H  -3.177235 1.707114 0.809334
H  -0.454623 3.16831 0.729402
H  -2.5416 1.014643 3.834173
H  -2.31473 0.119824 2.341904
H  -0.928894 0.480332 3.373415
H  -2.042066 3.501878 3.971272
H  -0.366208 2.978201 3.822339
H  -0.987514 4.229624 2.760202
H  -2.41469 4.712793 1.126276
H  0.335015 -0.281749 -1.782643
H  0.919546 -2.393137 -1.036172
H  3.064635 0.986688 0.5096
H  4.395351 -0.519835 1.944702
H  0.704751 -6.19004 0.230643
H  3.505797 -3.738621 -1.904961
H  0.409059 -7.59236 -1.781075
H  3.185625 -5.122881 -3.905476
H  1.639991 -7.056971 -3.864292
elementType: Cl F O N C H
totalener: -2149.93888583 hartree
nucrepener: 2844.02078591 hartree
electener: -4993.95967174 hartree
oneelecener: -8601.07536099 hartree
twoeener: 3607.11568925 hartree
cpcmener: -0.03240202 hartree
kineticenergy: 2143.46479523 hartree
xcener: -159.159335327380 hartree
chargesum: -0.0000000
charge: -0.054369 -0.059156 -0.206587 -0.282733 -0.442130 -0.325494 -0.087086 0.091788 0.026253 -0.077191 -0.268665 -0.268748 -0.196679 0.390026 0.039146 0.408101 -0.003993 -0.225251 -0.142242 -0.194179 0.167495 -0.172917 0.217347 0.267411 -0.242528 -0.172532 -0.121928 -0.151245 -0.181543 0.084756 0.095823 0.097960 0.096040 0.100497 0.101851 0.099253 0.091889 0.128892 0.136974 0.152518 0.150474 0.152543 0.147397 0.156940 0.157882 0.159833 0.158106
qa: -0.0544 -0.0592 -0.2066 -0.2827 -0.4421 -0.3255 -0.0871 0.0918 0.0263 -0.0772 -0.2687 -0.2687 -0.1967 0.3900 0.0391 0.4081 -0.0040 -0.2253 -0.1422 -0.1942 0.1675 -0.1729 0.2173 0.2674 -0.2425 -0.1725 -0.1219 -0.1512 -0.1815 0.0848 0.0958 0.0980 0.0960 0.1005 0.1019 0.0993 0.0919 0.1289 0.1370 0.1525 0.1505 0.1525 0.1474 0.1569 0.1579 0.1598 0.1581
va: 1.2718 1.2456 1.0871 2.1288 2.0732 2.0804 3.1118 3.7225 3.8894 3.8510 3.9021 3.9119 3.8966 4.1861 4.2148 3.7302 3.6312 4.0761 3.9300 3.9385 3.7371 3.8979 4.0707 3.7080 3.9992 3.8904 3.8894 3.8989 3.9048 1.0433 1.0340 0.9999 1.0190 0.9994 1.0007 1.0009 1.0057 1.0194 1.0203 1.0048 1.0084 0.9976 1.0071 0.9969 0.9891 0.9904 0.9903
dispcorr: -0.023112852 hartree
energy: -2149.961998683646
dipole: 13.95220 -14.00418 -0.05198 -17.20950 17.33133 0.12183 8.20117 -7.02853 1.17264
magnitude: 1.18010 au
magnitude: 2.99958 debye
