program: Orca
programVersion: 5.0.2
elementType: Cl Cl F O O O N C C C C C C C C C C C C C C C C C C C C C C H H H H H H H H H H H H H H H H H H
charge: 0
multiplicity: 1
keywords: wb97x-d3
keywords: def2-TZVPP
keywords: def2/J RIJCOSX
keywords: DEFGRID2
keywords: scfconv7
keywords: smallprint printgap noloewdin
keywords: NOSOSCF
formula: C22H18Cl2FNO3
InChI: InChI=1/C22H18Cl2FNO3/c1-22(2)15(11-19(23)24)20(22)21(27)29-18(12-26)13-8-9-16(25)17(10-13)28-14-6-4-3-5-7-14/h3-11,15,18,20H,1-2H3
47 atoms
Cl -4.197923 4.330845 -1.292082
Cl -4.682068 5.572564 1.265811
F  3.908499 -4.015934 0.644173
O  1.074443 1.545872 0.693434
O  -0.171845 1.174164 -1.130176
O  2.736605 -3.262345 -1.710272
N  4.021751 3.022039 0.82273
C  -2.458567 0.87027 0.996383
C  -2.529935 2.229135 0.365406
C  -1.216137 1.739946 0.950954
C  -2.594155 -0.331775 0.094334
C  -3.051664 0.643947 2.366121
C  -3.202992 3.35661 1.02018
C  -0.096109 1.452885 0.03895
C  -3.921909 4.287713 0.406213
C  2.268049 1.290562 -0.044209
C  2.728362 -0.13062 0.150811
C  3.247768 2.258359 0.453038
C  2.505518 -1.059183 -0.859277
C  3.320378 -0.529585 1.343135
C  2.898552 -2.375743 -0.691774
C  3.718756 -1.844972 1.51767
C  3.513663 -2.748928 0.497507
C  1.961915 -4.376728 -1.51464
C  2.17436 -5.432533 -2.391361
C  0.990495 -4.460062 -0.525926
C  1.4146 -6.585237 -2.265605
C  0.243336 -5.625187 -0.409218
C  0.45058 -6.692233 -1.270364
H  -2.570874 2.221317 -0.717863
H  -0.924973 2.170588 1.90218
H  -2.003174 -1.169145 0.470947
H  -3.638225 -0.649775 0.072944
H  -2.293789 -0.139975 -0.932936
H  -2.85943 1.460769 3.060606
H  -4.132872 0.51001 2.296077
H  -2.634242 -0.261769 2.809468
H  -3.106117 3.449994 2.09517
H  2.124389 1.49752 -1.108491
H  2.035858 -0.765062 -1.790281
H  3.492222 0.180076 2.142969
H  4.197689 -2.165437 2.433711
H  2.930765 -5.35081 -3.162565
H  0.801553 -3.635317 0.150129
H  1.584744 -7.407502 -2.948689
H  -0.509037 -5.691197 0.366779
H  -0.13392 -7.59718 -1.169521
elementType: Cl F O N C H
totalener: -2149.93929424 hartree
nucrepener: 2864.13056069 hartree
electener: -5014.06985492 hartree
oneelecener: -8641.10928594 hartree
twoeener: 3627.03943101 hartree
cpcmener: -0.03135208 hartree
kineticenergy: 2143.45302150 hartree
xcener: -159.156461125968 hartree
chargesum: -0.0000000
charge: -0.054371 -0.059276 -0.205169 -0.277175 -0.448871 -0.322113 -0.088496 0.089525 0.033420 -0.092910 -0.270329 -0.265917 -0.201709 0.413887 0.041591 0.398679 -0.032971 -0.218858 -0.146179 -0.160280 0.138522 -0.175570 0.271520 0.283013 -0.245113 -0.175225 -0.120563 -0.161537 -0.183967 0.081162 0.097844 0.100606 0.098928 0.095966 0.091500 0.102332 0.098084 0.128549 0.132813 0.138729 0.146880 0.153400 0.145045 0.152131 0.156754 0.158231 0.157487
qa: -0.0544 -0.0593 -0.2052 -0.2772 -0.4489 -0.3221 -0.0885 0.0895 0.0334 -0.0929 -0.2703 -0.2659 -0.2017 0.4139 0.0416 0.3987 -0.0330 -0.2189 -0.1462 -0.1603 0.1385 -0.1756 0.2715 0.2830 -0.2451 -0.1752 -0.1206 -0.1615 -0.1840 0.0812 0.0978 0.1006 0.0989 0.0960 0.0915 0.1023 0.0981 0.1285 0.1328 0.1387 0.1469 0.1534 0.1450 0.1521 0.1568 0.1582 0.1575
va: 1.2712 1.2454 1.0874 2.1303 2.0629 2.0787 3.1094 3.7320 3.8661 3.8541 3.9077 3.9094 3.8995 4.1749 4.2140 3.7288 3.6970 4.0737 3.9792 3.9587 3.7940 3.9330 3.9903 3.6803 3.9918 3.8704 3.8972 3.9163 3.9046 1.0472 1.0327 0.9993 1.0003 1.0182 1.0059 1.0006 1.0012 1.0195 1.0233 1.0223 1.0055 0.9987 1.0087 1.0024 0.9893 0.9909 0.9903
dispcorr: -0.023307408 hartree
energy: -2149.962601645655
dipole: 0.75209 -1.87311 -1.12102 -31.33715 29.68062 -1.65652 5.09735 -3.90854 1.18881
magnitude: 2.32681 au
magnitude: 5.91428 debye
