program: Orca
programVersion: 5.0.2
elementType: Cl Cl F O O O N C C C C C C C C C C C C C C C C C C C C C C H H H H H H H H H H H H H H H H H H
charge: 0
multiplicity: 1
keywords: wb97x-d3
keywords: def2-TZVPP
keywords: def2/J RIJCOSX
keywords: DEFGRID2
keywords: scfconv7
keywords: smallprint printgap noloewdin
keywords: NOSOSCF
formula: C22H18Cl2FNO3
InChI: InChI=1/C22H18Cl2FNO3/c1-22(2)15(11-19(23)24)20(22)21(27)29-18(12-26)13-8-9-16(25)17(10-13)28-14-6-4-3-5-7-14/h3-11,15,18,20H,1-2H3
47 atoms
Cl -4.194414 4.4716 -1.215223
Cl -4.814361 5.475434 1.41702
F  3.943969 -4.018491 0.402224
O  1.070017 1.526971 0.775819
O  -0.071437 1.483243 -1.153405
O  2.432559 -3.170234 -1.740388
N  4.003395 3.013462 1.122637
C  -2.437648 0.871635 0.838311
C  -2.527802 2.279629 0.326262
C  -1.225627 1.780403 0.923149
C  -2.488869 -0.244744 -0.176008
C  -3.071563 0.499645 2.156118
C  -3.263853 3.326519 1.045317
C  -0.05853 1.58746 0.045748
C  -3.984994 4.288303 0.483086
C  2.302085 1.324892 0.085183
C  2.755985 -0.108615 0.20078
C  3.255212 2.263114 0.680261
C  2.358571 -1.01015 -0.782414
C  3.520699 -0.547743 1.272945
C  2.747058 -2.336479 -0.714482
C  3.914226 -1.874864 1.349525
C  3.536844 -2.748113 0.354181
C  1.793265 -4.3603 -1.505263
C  1.965526 -5.34309 -2.471405
C  0.98297 -4.582601 -0.400902
C  1.32637 -6.563794 -2.323243
C  0.357177 -5.815496 -0.262957
C  0.525494 -6.810177 -1.215255
H  -2.527221 2.364299 -0.754481
H  -0.986224 2.129146 1.921372
H  -1.884546 -1.094332 0.148586
H  -3.51768 -0.594245 -0.27855
H  -2.149441 0.052482 -1.16574
H  -2.954054 1.265842 2.921475
H  -4.139572 0.313333 2.0292
H  -2.619158 -0.415147 2.542773
H  -3.212964 3.328471 2.127567
H  2.205687 1.59847 -0.969056
H  1.759728 -0.682502 -1.623564
H  3.835503 0.135634 2.051542
H  4.528771 -2.226159 2.168199
H  2.59724 -5.14907 -3.329551
H  0.824977 -3.814058 0.346163
H  1.464567 -7.328964 -3.076491
H  -0.270507 -5.993608 0.600813
H  0.035456 -7.767917 -1.097537
elementType: Cl F O N C H
totalener: -2149.93885467 hartree
nucrepener: 2859.95649129 hartree
electener: -5009.89534596 hartree
oneelecener: -8632.74023547 hartree
twoeener: 3622.84488951 hartree
cpcmener: -0.03071254 hartree
kineticenergy: 2143.44734632 hartree
xcener: -159.155681529145 hartree
chargesum: -0.0000000
charge: -0.054389 -0.059717 -0.205746 -0.274985 -0.444174 -0.319293 -0.087857 0.092186 0.031942 -0.094753 -0.269516 -0.265384 -0.202894 0.413587 0.041762 0.391659 -0.038120 -0.216457 -0.149590 -0.157654 0.135940 -0.170429 0.270644 0.293507 -0.254223 -0.187635 -0.115858 -0.150538 -0.188903 0.080131 0.098193 0.100177 0.099725 0.095914 0.090998 0.101857 0.098440 0.129185 0.134193 0.140288 0.143623 0.153211 0.144867 0.152701 0.157185 0.158710 0.157490
qa: -0.0544 -0.0597 -0.2057 -0.2750 -0.4442 -0.3193 -0.0879 0.0922 0.0319 -0.0948 -0.2695 -0.2654 -0.2029 0.4136 0.0418 0.3917 -0.0381 -0.2165 -0.1496 -0.1577 0.1359 -0.1704 0.2706 0.2935 -0.2542 -0.1876 -0.1159 -0.1505 -0.1889 0.0801 0.0982 0.1002 0.0997 0.0959 0.0910 0.1019 0.0984 0.1292 0.1342 0.1403 0.1436 0.1532 0.1449 0.1527 0.1572 0.1587 0.1575
va: 1.2712 1.2449 1.0856 2.1222 2.0701 2.0792 3.1095 3.7370 3.8656 3.8488 3.9097 3.9079 3.8987 4.1806 4.2143 3.7301 3.7466 4.0662 3.9638 3.9555 3.8055 3.9347 3.9738 3.6696 4.0006 3.8886 3.8904 3.9061 3.9079 1.0478 1.0328 0.9997 1.0008 1.0170 1.0058 1.0010 1.0011 1.0193 1.0253 1.0252 1.0082 0.9987 1.0093 1.0023 0.9890 0.9904 0.9905
dispcorr: -0.023283398 hartree
energy: -2149.962138072824
dipole: 1.72024 -2.71147 -0.99123 -32.08089 30.19876 -1.88213 3.60765 -2.57064 1.03701
magnitude: 2.36650 au
magnitude: 6.01517 debye
